{"text_format":"1","workbook":"xlsx","n_sheets":5,"sheets":["Tableau","Poules A - B","Poules C - D","Poules E - F","Feuil1"],"not_rendered":{"charts":0,"images":0,"macros":1,"external_links":0,"defined_names":8,"comments":0,"pivot_tables":0},"unopened":[],"bounds":{"document_bytes":16777216,"sheet_cells":100000,"rows_first":2000,"rows_last":500,"rows_between":2000,"halvings":0,"cell_chars":16384,"cell_head_chars":4096},"cells_cut":0,"cells_raw":0,"read":"whole","date_system":"1900"}

{"sheet":"Tableau","index":0,"n_rows":38,"n_cols":26,"rows_kept":38,"cut":false,"hidden":false,"merged":[[30,3,30,4],[22,8,23,8],[19,8,20,8],[16,8,17,8],[10,8,11,8],[4,8,5,8],[1,8,2,8],[6,25,18,27],[13,8,14,8],[25,0,25,2],[7,8,8,8]]}
["Rang","NOM Prénom","Points",null,"Pos","Poule A","Class.",null,null,null,"PRINCIPAL   1/8 F","Table",null,"1/4 F","Table",null,"1/2 F","Table",null,"Finale","Table",null,"Class.","Classement final",null,"ATTENTION, NE PAS LANCER DE 1/8 DE FINALE AVANT D'AVOIR :\n\n1) TERMINE LES POULES\n\n2) FAIT LE DEPARTAGE MANUEL DES EX AEQUO DANS LES POULES LE CAS ECHEANT\n\n3) CLIQUE SUR LE BOUTON MAJ CLT SERVANT A DETERMINER LES MEILLEURS 3E DE POULES"]
["1*","Lik",14,null,1,{"$f":"B2","v":"Lik"},{"$f":"INDEX('Poules A - B'!$J$16:$M$16,MATCH(Tableau!E2,'Poules A - B'!$J$8:$M$8,0))","v":1},{"$f":"IF(G2=\"\",\"\",G2&RIGHT($F$1,1))","v":"1A"},null,"1A",{"$f":"IF(ISNA(INDEX($F$2:$F$30,MATCH(J2,$H$2:$H$30,0))),\"\",INDEX($F$2:$F$30,MATCH(J2,$H$2:$H$30,0)))","v":"Lik"},"G","G",{"$f":"IF(L2=\"\",\"\",IF(L2=\"G\",K2,K3))","v":"Lik"},"G","G",{"$f":"IF(O2=\"\",\"\",IF(O2=\"G\",N2,N3))","v":"Lik"},"G","G",{"$f":"IF(R2=\"\",\"\",IF(R2=\"G\",Q2,Q3))","v":"Lik"},"P",null,1,{"$f":"IF(U2=\"\",\"\",IF(U2=\"G\",T2,T3))","v":"Zan"}]
["2*","Zan",13,null,2,{"$f":"B13","v":"Noël"},{"$f":"INDEX('Poules A - B'!$J$16:$M$16,MATCH(Tableau!E3,'Poules A - B'!$J$8:$M$8,0))","v":2},{"$f":"IF(G3=\"\",\"\",G3&RIGHT($F$1,1))","v":"2A"},null,"4e meill. 3e",{"$f":"B36","v":"Romain"},null,"G",{"$f":"IF(L5=\"\",\"\",IF(L5=\"G\",K5,K6))","v":"Maxime"},null,"G",{"$f":"IF(O5=\"\",\"\",IF(O5=\"G\",N5,N6))","v":"Sebden"},null,"G",{"$f":"IF(R5=\"\",\"\",IF(R5=\"G\",Q5,Q6))","v":"Zan"},null,null,2,{"$f":"IF(U2=\"\",\"\",IF(U2=\"P\",T2,T3))","v":"Lik"}]
["3*","Matthieu",11,null,3,{"$f":"B14","v":"SebAZ"},{"$f":"INDEX('Poules A - B'!$J$16:$M$16,MATCH(Tableau!E4,'Poules A - B'!$J$8:$M$8,0))","v":3},{"$f":"IF(G4=\"\",\"\",G4&RIGHT($F$1,1))","v":"3A"},null,null,null,null,null,null,null,null,null,null,null,"3 / 4",null,null,3,{"$f":"IF(U5=\"\",\"\",IF(U5=\"G\",T5,T6))","v":"Sebden"}]
["4*","Sebden",10,null,4,{"$f":"B25","v":0},{"$f":"INDEX('Poules A - B'!$J$16:$M$16,MATCH(Tableau!E5,'Poules A - B'!$J$8:$M$8,0))","v":4},{"$f":"IF(G5=\"\",\"\",G5&RIGHT($F$1,1))","v":"4A"},null,"2F",{"$f":"IF(ISNA(INDEX($F$2:$F$30,MATCH(J5,$H$2:$H$30,0))),\"\",INDEX($F$2:$F$30,MATCH(J5,$H$2:$H$30,0)))","v":"Maxime"},"G","G",{"$f":"IF(L8=\"\",\"\",IF(L8=\"G\",K8,K9))","v":"Tom"},"P","G",{"$f":"IF(O8=\"\",\"\",IF(O8=\"G\",N8,N9))","v":"Matthieu"},"P","P",{"$f":"IF(R2=\"\",\"\",IF(R2=\"P\",Q2,Q3))","v":"Sebden"},"G",null,4,{"$f":"IF(U5=\"\",\"\",IF(U5=\"P\",T5,T6))","v":"Matthieu"}]
["5*","Tom",9,null,null,"Poule B",null,null,null,"2B",{"$f":"IF(ISNA(INDEX($F$2:$F$30,MATCH(J6,$H$2:$H$30,0))),\"\",INDEX($F$2:$F$30,MATCH(J6,$H$2:$H$30,0)))","v":"Ariel"},null,"G",{"$f":"IF(L11=\"\",\"\",IF(L11=\"G\",K11,K12))","v":"Sebden"},null,"G",{"$f":"IF(O11=\"\",\"\",IF(O11=\"G\",N11,N12))","v":"Zan"},null,"P",{"$f":"IF(R5=\"\",\"\",IF(R5=\"P\",Q5,Q6))","v":"Matthieu"},null,null,5,{"$f":"IF(U8=\"\",\"\",IF(U8=\"G\",T8,T9))","v":"Tom"}]
["6*","Flo",8,null,1,{"$f":"B3","v":"Zan"},{"$f":"INDEX('Poules A - B'!$J$33:$M$33,MATCH(Tableau!E7,'Poules A - B'!$J$25:$M$25,0))","v":1},{"$f":"IF(G7=\"\",\"\",G7&RIGHT($F$6,1))","v":"1B"},null,null,null,null,null,null,null,null,"5 à 8",null,null,"5 / 6",null,null,6,{"$f":"IF(U8=\"\",\"\",IF(U8=\"P\",T8,T9))","v":"Flo"},null,"ATTENTION, NE PAS LANCER DE 1/8 DE FINALE AVANT D'AVOIR :\n\n1) TERMINE LES POULES\n\n2) FAIT LE DEPARTAGE MANUEL DES EX AEQUO DANS LES POULES LE CAS ECHEANT\n\n3) CLIQUE SUR LE BOUTON MAJ CLT SERVANT A DETERMINER LES MEILLEURS 3E DE POULES"]
[7,"Maxime",7,null,2,{"$f":"B12","v":"Ariel"},{"$f":"INDEX('Poules A - B'!$J$33:$M$33,MATCH(Tableau!E8,'Poules A - B'!$J$25:$M$25,0))","v":2},{"$f":"IF(G8=\"\",\"\",G8&RIGHT($F$6,1))","v":"2B"},null,"1E",{"$f":"IF(ISNA(INDEX($F$2:$F$30,MATCH(J8,$H$2:$H$30,0))),\"\",INDEX($F$2:$F$30,MATCH(J8,$H$2:$H$30,0)))","v":"Tom"},"G","G",{"$f":"IF(L14=\"\",\"\",IF(L14=\"G\",K14,K15))","v":"Matthieu"},"G","P",{"$f":"IF(O2=\"\",\"\",IF(O2=\"P\",N2,N3))","v":"Maxime"},"P","G",{"$f":"IF(R8=\"\",\"\",IF(R8=\"G\",Q8,Q9))","v":"Tom"},"G",null,7,{"$f":"IF(U11=\"\",\"\",IF(U11=\"G\",T11,T12))","v":"Maxime"}]
[8,"Val",7,null,3,{"$f":"B15","v":"Stephane"},{"$f":"INDEX('Poules A - B'!$J$33:$M$33,MATCH(Tableau!E9,'Poules A - B'!$J$25:$M$25,0))","v":3},{"$f":"IF(G9=\"\",\"\",G9&RIGHT($F$6,1))","v":"3B"},null,"2C","Axel",null,"G",{"$f":"IF(L17=\"\",\"\",IF(L17=\"G\",K17,K18))","v":"Flo"},null,"P",{"$f":"IF(O5=\"\",\"\",IF(O5=\"P\",N5,N6))","v":"Tom"},null,"G",{"$f":"IF(R11=\"\",\"\",IF(R11=\"G\",Q11,Q12))","v":"Flo"},null,null,8,{"$f":"IF(U11=\"\",\"\",IF(U11=\"P\",T11,T12))","v":"Noël"}]
[9,"Eric",7,null,4,{"$f":"B24","v":0},{"$f":"INDEX('Poules A - B'!$J$33:$M$33,MATCH(Tableau!E10,'Poules A - B'!$J$25:$M$25,0))","v":4},{"$f":"IF(G10=\"\",\"\",G10&RIGHT($F$6,1))","v":"4B"},null,null,null,null,null,null,null,null,null,null,null,"7 / 8",null,null,9,{"$f":"IF(U14=\"\",\"\",IF(U14=\"G\",T14,T15))","v":"Ariel"}]
{"$rows_left_out":29}
{"sheet":"Poules A - B","index":1,"n_rows":33,"n_cols":31,"rows_kept":33,"cut":false,"hidden":false,"merged":[[1,1,1,2],[18,1,18,2],[17,8,19,11],[0,8,2,11],[22,1,22,2],[2,1,2,2],[3,1,3,2],[4,1,4,2],[5,1,5,2],[24,4,24,8],[7,4,7,8],[19,1,19,2],[20,1,20,2],[21,1,21,2],[6,14,6,15],[6,16,6,17],[6,18,6,19],[6,20,6,21],[15,14,15,15],[15,16,15,17],[15,18,15,19],[15,20,15,21],[23,14,23,15],[23,16,23,17],[23,18,23,19],[23,20,23,21],[32,14,32,15],[32,16,32,17],[32,18,32,19],[32,20,32,21],[6,23,6,24],[6,25,6,26],[6,27,6,28],[6,29,6,30],[15,23,15,24],[15,25,15,26],[15,27,15,28],[15,29,15,30],[23,23,23,24],[23,25,23,26],[23,27,23,28],[23,29,23,30],[32,23,32,24],[32,25,32,26],[32,27,32,28],[32,29,32,30]]}
["POULE","A"]
[null,"NOM Prénom",null,"Clt",null,null,null,"TABLE"]
[1,{"$f":"Tableau!F2","v":"Lik"},null,1]
[2,{"$f":"Tableau!F3","v":"Noël"},null,2]
[3,{"$f":"Tableau!F4","v":"SebAZ"},null,3]
[4,{"$f":"Tableau!F5","v":0},null,4,null,null,null,null,null,null,null,null,null,"Sets",null,null,null,null,null,null,null,null,"Pts"]
[null,null,null,null,null,null,null,null,null,null,null,null,"1 pour victoire - 0 pour défaite",null,1,null,2,null,3,null,4,null,null,1,null,2,null,3,null,4]
[null,"Nom Prénom","Nom Prénom","Table","Scores",null,null,null,null,1,2,3,4,null,"G","P","G","P","G","P","G","P",null,"G","P","G","P","G","P","G","P"]
["1 contre 4",{"$f":"B3","v":"Lik"},{"$f":"B6","v":0},null,null,null,null,null,null,{"$f":"IF(SUM($E9:$I9)=0,0,IF(COUNTIF($E9:$I9,\">0\")-COUNTIF($E9:$I9,\"<0\")>0,1,0))","v":0},null,null,{"$f":"IF(SUM($E9:$I9)=0,0,IF(COUNTIF($E9:$I9,\">0\")-COUNTIF($E9:$I9,\"<0\")<0,1,0))","v":0},null,{"$f":"COUNTIF($E9:$I9,\">0\")","v":0},{"$f":"COUNTIF($E9:$I9,\"<0\")","v":0},null,null,null,null,{"$f":"P9","v":0},{"$f":"O9","v":0},null,{"$f":"IF(ISBLANK($E9),0,IF($E9<0,-$E9,IF($E9>9,$E9+2,11)))+IF(ISBLANK($F9),0,IF($F9<0,-$F9,IF($F9>9,$F9+2,11)))+IF(ISBLANK($G9),0,IF($G9<0,-$G9,IF($G9>9,$G9+2,11)))+IF(ISBLANK($H9),0,IF($H9<0,-$H9,IF($H9>9,$H9+2,11)))+IF(ISBLANK($I9),0,IF($I9<0,-$I9,IF($I9>9,$I9+2,11)))","v":0},{"$f":"IF(ISBLANK($E9),0,IF($E9>0,$E9,IF($E9<-9,-$E9+2,11)))+IF(ISBLANK($F9),0,IF($F9>0,$F9,IF($F9<-9,-$F9+2,11)))+IF(ISBLANK($G9),0,IF($G9>0,$G9,IF($G9<-9,-$G9+2,11)))+IF(ISBLANK($H9),0,IF($H9>0,$H9,IF($H9<-9,-$H9+2,11)))+IF(ISBLANK($I9),0,IF($I9>0,$I9,IF($I9<-9,-$I9+2,11)))","v":0},null,null,null,null,{"$f":"Y9","v":0},{"$f":"X9","v":0}]
["2 contre 3",{"$f":"B4","v":"Noël"},{"$f":"B5","v":"SebAZ"},1,11,3,-10,7,null,null,{"$f":"IF(SUM($E10:$I10)=0,0,IF(COUNTIF($E10:$I10,\">0\")-COUNTIF($E10:$I10,\"<0\")>0,1,0))","v":1},{"$f":"IF(SUM($E10:$I10)=0,0,IF(COUNTIF($E10:$I10,\">0\")-COUNTIF($E10:$I10,\"<0\")<0,1,0))","v":0},null,null,null,null,{"$f":"COUNTIF($E10:$I10,\">0\")","v":3},{"$f":"COUNTIF($E10:$I10,\"<0\")","v":1},{"$f":"+R10","v":1},{"$f":"+Q10","v":3},null,null,null,null,null,{"$f":"IF(ISBLANK($E10),0,IF($E10<0,-$E10,IF($E10>9,$E10+2,11)))+IF(ISBLANK($F10),0,IF($F10<0,-$F10,IF($F10>9,$F10+2,11)))+IF(ISBLANK($G10),0,IF($G10<0,-$G10,IF($G10>9,$G10+2,11)))+IF(ISBLANK($H10),0,IF($H10<0,-$H10,IF($H10>9,$H10+2,11)))+IF(ISBLANK($I10),0,IF($I10<0,-$I10,IF($I10>9,$I10+2,11)))","v":45},{"$f":"IF(ISBLANK($E10),0,IF($E10>0,$E10,IF($E10<-9,-$E10+2,11)))+IF(ISBLANK($F10),0,IF($F10>0,$F10,IF($F10<-9,-$F10+2,11)))+IF(ISBLANK($G10),0,IF($G10>0,$G10,IF($G10<-9,-$G10+2,11)))+IF(ISBLANK($H10),0,IF($H10>0,$H10,IF($H10<-9,-$H10+2,11)))+IF(ISBLANK($I10),0,IF($I10>0,$I10,IF($I10<-9,-$I10+2,11)))","v":33},{"$f":"+AA10","v":33},{"$f":"+Z10","v":45}]
{"$rows_left_out":24}
{"sheet":"Poules C - D","index":2,"n_rows":33,"n_cols":31,"rows_kept":33,"cut":false,"hidden":false,"merged":[[20,1,20,2],[21,1,21,2],[24,4,24,8],[2,1,2,2],[3,1,3,2],[4,1,4,2],[5,1,5,2],[7,4,7,8],[22,1,22,2],[19,1,19,2],[0,8,2,11],[1,1,1,2],[18,1,18,2],[17,8,19,11],[6,20,6,21],[15,14,15,15],[15,16,15,17],[15,18,15,19],[15,20,15,21],[6,14,6,15],[6,16,6,17],[6,18,6,19],[23,14,23,15],[23,16,23,17],[23,18,23,19],[23,20,23,21],[32,14,32,15],[32,16,32,17],[32,18,32,19],[32,20,32,21],[6,23,6,24],[6,25,6,26],[6,27,6,28],[6,29,6,30],[15,23,15,24],[15,25,15,26],[15,27,15,28],[15,29,15,30],[23,23,23,24],[23,25,23,26],[23,27,23,28],[23,29,23,30],[32,23,32,24],[32,25,32,26],[32,27,32,28],[32,29,32,30]]}
["POULE","C"]
[null,"NOM Prénom",null,"Clt",null,null,null,"TABLE"]
[1,{"$f":"Tableau!F12","v":"Matthieu"},null,1]
[2,{"$f":"Tableau!F13","v":"KarineA"},null,2]
[3,{"$f":"Tableau!F14","v":"Romain"},null,3]
[4,{"$f":"Tableau!F15","v":0},null,4,null,null,null,null,null,null,null,null,null,"Sets",null,null,null,null,null,null,null,null,"Pts"]
[null,null,null,null,null,null,null,null,null,null,null,null,"1 pour victoire - 0 pour défaite",null,1,null,2,null,3,null,4,null,null,1,null,2,null,3,null,4]
[null,"Nom Prénom","Nom Prénom","Table","Scores",null,null,null,null,1,2,3,4,null,"G","P","G","P","G","P","G","P",null,"G","P","G","P","G","P","G","P"]
["1 contre 4",{"$f":"B3","v":"Matthieu"},{"$f":"B6","v":0},null,null,null,null,null,null,{"$f":"IF(SUM($E9:$I9)=0,0,IF(COUNTIF($E9:$I9,\">0\")-COUNTIF($E9:$I9,\"<0\")>0,1,0))","v":0},null,null,{"$f":"IF(SUM($E9:$I9)=0,0,IF(COUNTIF($E9:$I9,\">0\")-COUNTIF($E9:$I9,\"<0\")<0,1,0))","v":0},null,{"$f":"COUNTIF($E9:$I9,\">0\")","v":0},{"$f":"COUNTIF($E9:$I9,\"<0\")","v":0},null,null,null,null,{"$f":"P9","v":0},{"$f":"O9","v":0},null,{"$f":"IF(ISBLANK($E9),0,IF($E9<0,-$E9,IF($E9>9,$E9+2,11)))+IF(ISBLANK($F9),0,IF($F9<0,-$F9,IF($F9>9,$F9+2,11)))+IF(ISBLANK($G9),0,IF($G9<0,-$G9,IF($G9>9,$G9+2,11)))+IF(ISBLANK($H9),0,IF($H9<0,-$H9,IF($H9>9,$H9+2,11)))+IF(ISBLANK($I9),0,IF($I9<0,-$I9,IF($I9>9,$I9+2,11)))","v":0},{"$f":"IF(ISBLANK($E9),0,IF($E9>0,$E9,IF($E9<-9,-$E9+2,11)))+IF(ISBLANK($F9),0,IF($F9>0,$F9,IF($F9<-9,-$F9+2,11)))+IF(ISBLANK($G9),0,IF($G9>0,$G9,IF($G9<-9,-$G9+2,11)))+IF(ISBLANK($H9),0,IF($H9>0,$H9,IF($H9<-9,-$H9+2,11)))+IF(ISBLANK($I9),0,IF($I9>0,$I9,IF($I9<-9,-$I9+2,11)))","v":0},null,null,null,null,{"$f":"Y9","v":0},{"$f":"X9","v":0}]
["2 contre 3",{"$f":"B4","v":"KarineA"},{"$f":"B5","v":"Romain"},null,4,5,14,null,null,null,{"$f":"IF(SUM($E10:$I10)=0,0,IF(COUNTIF($E10:$I10,\">0\")-COUNTIF($E10:$I10,\"<0\")>0,1,0))","v":1},{"$f":"IF(SUM($E10:$I10)=0,0,IF(COUNTIF($E10:$I10,\">0\")-COUNTIF($E10:$I10,\"<0\")<0,1,0))","v":0},null,null,null,null,{"$f":"COUNTIF($E10:$I10,\">0\")","v":3},{"$f":"COUNTIF($E10:$I10,\"<0\")","v":0},{"$f":"+R10","v":0},{"$f":"+Q10","v":3},null,null,null,null,null,{"$f":"IF(ISBLANK($E10),0,IF($E10<0,-$E10,IF($E10>9,$E10+2,11)))+IF(ISBLANK($F10),0,IF($F10<0,-$F10,IF($F10>9,$F10+2,11)))+IF(ISBLANK($G10),0,IF($G10<0,-$G10,IF($G10>9,$G10+2,11)))+IF(ISBLANK($H10),0,IF($H10<0,-$H10,IF($H10>9,$H10+2,11)))+IF(ISBLANK($I10),0,IF($I10<0,-$I10,IF($I10>9,$I10+2,11)))","v":38},{"$f":"IF(ISBLANK($E10),0,IF($E10>0,$E10,IF($E10<-9,-$E10+2,11)))+IF(ISBLANK($F10),0,IF($F10>0,$F10,IF($F10<-9,-$F10+2,11)))+IF(ISBLANK($G10),0,IF($G10>0,$G10,IF($G10<-9,-$G10+2,11)))+IF(ISBLANK($H10),0,IF($H10>0,$H10,IF($H10<-9,-$H10+2,11)))+IF(ISBLANK($I10),0,IF($I10>0,$I10,IF($I10<-9,-$I10+2,11)))","v":23},{"$f":"+AA10","v":23},{"$f":"+Z10","v":38}]
{"$rows_left_out":24}
{"sheet":"Poules E - F","index":3,"n_rows":33,"n_cols":31,"rows_kept":33,"cut":false,"hidden":false,"merged":[[18,1,18,2],[0,8,2,11],[17,8,19,11],[22,1,22,2],[24,4,24,8],[7,4,7,8],[19,1,19,2],[20,1,20,2],[21,1,21,2],[2,1,2,2],[3,1,3,2],[4,1,4,2],[5,1,5,2],[1,1,1,2],[6,14,6,15],[6,16,6,17],[6,18,6,19],[6,20,6,21],[15,14,15,15],[15,16,15,17],[15,18,15,19],[15,20,15,21],[23,14,23,15],[23,16,23,17],[23,18,23,19],[23,20,23,21],[32,14,32,15],[32,16,32,17],[32,18,32,19],[32,20,32,21],[6,23,6,24],[6,25,6,26],[6,27,6,28],[6,29,6,30],[15,23,15,24],[15,25,15,26],[15,27,15,28],[15,29,15,30],[23,23,23,24],[23,25,23,26],[23,27,23,28],[23,29,23,30],[32,23,32,24],[32,25,32,26],[32,27,32,28],[32,29,32,30]]}
["POULE","E"]
[null,"NOM Prénom",null,"Clt",null,"TABLE"]
[1,{"$f":"Tableau!F22","v":"Tom"},null,1]
[2,{"$f":"Tableau!F23","v":"Val"},null,2]
[3,{"$f":"Tableau!F24","v":"Axel"},null,3]
[4,{"$f":"Tableau!F25","v":"KarineLL"},null,4,null,null,null,null,null,null,null,null,null,"Sets",null,null,null,null,null,null,null,null,"Pts"]
[null,null,null,null,null,null,null,null,null,null,null,null,"1 pour victoire - 0 pour défaite",null,1,null,2,null,3,null,4,null,null,1,null,2,null,3,null,4]
[null,"Nom Prénom","Nom Prénom","Table","Scores",null,null,null,null,1,2,3,4,null,"G","P","G","P","G","P","G","P",null,"G","P","G","P","G","P","G","P"]
["1 contre 4",{"$f":"B3","v":"Tom"},{"$f":"B6","v":"KarineLL"},5,3,5,4,null,null,{"$f":"IF(SUM($E9:$I9)=0,0,IF(COUNTIF($E9:$I9,\">0\")-COUNTIF($E9:$I9,\"<0\")>0,1,0))","v":1},null,null,{"$f":"IF(SUM($E9:$I9)=0,0,IF(COUNTIF($E9:$I9,\">0\")-COUNTIF($E9:$I9,\"<0\")<0,1,0))","v":0},null,{"$f":"COUNTIF($E9:$I9,\">0\")","v":3},{"$f":"COUNTIF($E9:$I9,\"<0\")","v":0},null,null,null,null,{"$f":"P9","v":0},{"$f":"O9","v":3},null,{"$f":"IF(ISBLANK($E9),0,IF($E9<0,-$E9,IF($E9>9,$E9+2,11)))+IF(ISBLANK($F9),0,IF($F9<0,-$F9,IF($F9>9,$F9+2,11)))+IF(ISBLANK($G9),0,IF($G9<0,-$G9,IF($G9>9,$G9+2,11)))+IF(ISBLANK($H9),0,IF($H9<0,-$H9,IF($H9>9,$H9+2,11)))+IF(ISBLANK($I9),0,IF($I9<0,-$I9,IF($I9>9,$I9+2,11)))","v":33},{"$f":"IF(ISBLANK($E9),0,IF($E9>0,$E9,IF($E9<-9,-$E9+2,11)))+IF(ISBLANK($F9),0,IF($F9>0,$F9,IF($F9<-9,-$F9+2,11)))+IF(ISBLANK($G9),0,IF($G9>0,$G9,IF($G9<-9,-$G9+2,11)))+IF(ISBLANK($H9),0,IF($H9>0,$H9,IF($H9<-9,-$H9+2,11)))+IF(ISBLANK($I9),0,IF($I9>0,$I9,IF($I9<-9,-$I9+2,11)))","v":12},null,null,null,null,{"$f":"Y9","v":12},{"$f":"X9","v":33}]
["2 contre 3",{"$f":"B4","v":"Val"},{"$f":"B5","v":"Axel"},5,7,2,5,null,null,null,{"$f":"IF(SUM($E10:$I10)=0,0,IF(COUNTIF($E10:$I10,\">0\")-COUNTIF($E10:$I10,\"<0\")>0,1,0))","v":1},{"$f":"IF(SUM($E10:$I10)=0,0,IF(COUNTIF($E10:$I10,\">0\")-COUNTIF($E10:$I10,\"<0\")<0,1,0))","v":0},null,null,null,null,{"$f":"COUNTIF($E10:$I10,\">0\")","v":3},{"$f":"COUNTIF($E10:$I10,\"<0\")","v":0},{"$f":"+R10","v":0},{"$f":"+Q10","v":3},null,null,null,null,null,{"$f":"IF(ISBLANK($E10),0,IF($E10<0,-$E10,IF($E10>9,$E10+2,11)))+IF(ISBLANK($F10),0,IF($F10<0,-$F10,IF($F10>9,$F10+2,11)))+IF(ISBLANK($G10),0,IF($G10<0,-$G10,IF($G10>9,$G10+2,11)))+IF(ISBLANK($H10),0,IF($H10<0,-$H10,IF($H10>9,$H10+2,11)))+IF(ISBLANK($I10),0,IF($I10<0,-$I10,IF($I10>9,$I10+2,11)))","v":33},{"$f":"IF(ISBLANK($E10),0,IF($E10>0,$E10,IF($E10<-9,-$E10+2,11)))+IF(ISBLANK($F10),0,IF($F10>0,$F10,IF($F10<-9,-$F10+2,11)))+IF(ISBLANK($G10),0,IF($G10>0,$G10,IF($G10<-9,-$G10+2,11)))+IF(ISBLANK($H10),0,IF($H10>0,$H10,IF($H10<-9,-$H10+2,11)))+IF(ISBLANK($I10),0,IF($I10>0,$I10,IF($I10<-9,-$I10+2,11)))","v":14},{"$f":"+AA10","v":14},{"$f":"+Z10","v":33}]
{"$rows_left_out":24}
{"sheet":"Feuil1","index":4,"n_rows":6,"n_cols":11,"rows_kept":6,"cut":false,"hidden":false,"merged":[]}
["3E",{"$f":"VLOOKUP(INDEX('Poules E - F'!$J$8:$M$8,MATCH(3,'Poules E - F'!$J$16:$M$16,0)),'Poules E - F'!$A$3:$C$6,2,FALSE)","v":"Axel"},{"$f":"INDEX('Poules E - F'!$J$15:$M$15,MATCH(3,'Poules E - F'!$J$16:$M$16,0))","v":0},{"$f":"HLOOKUP(INDEX('Poules E - F'!$J$8:$M$8,MATCH(3,'Poules E - F'!$J$16:$M$16,0)),'Poules E - F'!$O$7:$V$16,10,FALSE)","v":0},{"$f":"HLOOKUP(INDEX('Poules E - F'!$J$8:$M$8,MATCH(3,'Poules E - F'!$J$16:$M$16,0)),'Poules E - F'!$X$7:$AE$16,10,FALSE)","v":0.3125},null,"3B",{"$f":"VLOOKUP(INDEX('Poules A - B'!$J$25:$M$25,MATCH(3,'Poules A - B'!$J$33:$M$33,0)),'Poules A - B'!$A$20:$C$23,2,FALSE)","v":"Stephane"},{"$f":"INDEX('Poules A - B'!$J$32:$M$32,MATCH(3,'Poules A - B'!$J$33:$M$33,0))","v":0},{"$f":"HLOOKUP(INDEX('Poules A - B'!$J$25:$M$25,MATCH(3,'Poules A - B'!$J$33:$M$33,0)),'Poules A - B'!$O$24:$V$33,10,FALSE)","v":0.33333333333333331},{"$f":"HLOOKUP(INDEX('Poules A - B'!$J$25:$M$25,MATCH(3,'Poules A - B'!$J$33:$M$33,0)),'Poules A - B'!$X$24:$AE$33,10,FALSE)","v":0.44}]
["3F",{"$f":"VLOOKUP(INDEX('Poules E - F'!$J$25:$M$25,MATCH(3,'Poules E - F'!$J$33:$M$33,0)),'Poules E - F'!$A$20:$C$23,2,FALSE)","v":"Jules"},{"$f":"INDEX('Poules E - F'!$J$32:$M$32,MATCH(3,'Poules E - F'!$J$33:$M$33,0))","v":0},{"$f":"HLOOKUP(INDEX('Poules E - F'!$J$25:$M$25,MATCH(3,'Poules E - F'!$J$33:$M$33,0)),'Poules E - F'!$O$24:$V$33,10,FALSE)","v":0},{"$f":"HLOOKUP(INDEX('Poules E - F'!$J$25:$M$25,MATCH(3,'Poules E - F'!$J$33:$M$33,0)),'Poules E - F'!$X$24:$AE$33,10,FALSE)","v":0.28260869565217389},null,"3D",{"$f":"VLOOKUP(INDEX('Poules C - D'!$J$25:$M$25,MATCH(3,'Poules C - D'!$J$33:$M$33,0)),'Poules C - D'!$A$20:$C$23,2,FALSE)","v":"Eric"},{"$f":"INDEX('Poules C - D'!$J$32:$M$32,MATCH(3,'Poules C - D'!$J$33:$M$33,0))","v":0},{"$f":"HLOOKUP(INDEX('Poules C - D'!$J$25:$M$25,MATCH(3,'Poules C - D'!$J$33:$M$33,0)),'Poules C - D'!$O$24:$V$33,10,FALSE)","v":0.25},{"$f":"HLOOKUP(INDEX('Poules C - D'!$J$25:$M$25,MATCH(3,'Poules C - D'!$J$33:$M$33,0)),'Poules C - D'!$X$24:$AE$33,10,FALSE)","v":0.4370860927152318}]
["3B",{"$f":"VLOOKUP(INDEX('Poules A - B'!$J$25:$M$25,MATCH(3,'Poules A - B'!$J$33:$M$33,0)),'Poules A - B'!$A$20:$C$23,2,FALSE)","v":"Stephane"},{"$f":"INDEX('Poules A - B'!$J$32:$M$32,MATCH(3,'Poules A - B'!$J$33:$M$33,0))","v":0},{"$f":"HLOOKUP(INDEX('Poules A - B'!$J$25:$M$25,MATCH(3,'Poules A - B'!$J$33:$M$33,0)),'Poules A - B'!$O$24:$V$33,10,FALSE)","v":0.33333333333333331},{"$f":"HLOOKUP(INDEX('Poules A - B'!$J$25:$M$25,MATCH(3,'Poules A - B'!$J$33:$M$33,0)),'Poules A - B'!$X$24:$AE$33,10,FALSE)","v":0.44},null,"3A",{"$f":"VLOOKUP(INDEX('Poules A - B'!$J$8:$M$8,MATCH(3,'Poules A - B'!$J$16:$M$16,0)),'Poules A - B'!$A$3:$C$6,2,FALSE)","v":"SebAZ"},{"$f":"INDEX('Poules A - B'!$J$15:$M$15,MATCH(3,'Poules A - B'!$J$16:$M$16,0))","v":0},{"$f":"HLOOKUP(INDEX('Poules A - B'!$J$8:$M$8,MATCH(3,'Poules A - B'!$J$16:$M$16,0)),'Poules A - B'!$O$7:$V$16,10,FALSE)","v":0.14285714285714285},{"$f":"HLOOKUP(INDEX('Poules A - B'!$J$8:$M$8,MATCH(3,'Poules A - B'!$J$16:$M$16,0)),'Poules A - B'!$X$7:$AE$16,10,FALSE)","v":0.40740740740740738}]
["3D",{"$f":"VLOOKUP(INDEX('Poules C - D'!$J$25:$M$25,MATCH(3,'Poules C - D'!$J$33:$M$33,0)),'Poules C - D'!$A$20:$C$23,2,FALSE)","v":"Eric"},{"$f":"INDEX('Poules C - D'!$J$32:$M$32,MATCH(3,'Poules C - D'!$J$33:$M$33,0))","v":0},{"$f":"HLOOKUP(INDEX('Poules C - D'!$J$25:$M$25,MATCH(3,'Poules C - D'!$J$33:$M$33,0)),'Poules C - D'!$O$24:$V$33,10,FALSE)","v":0.25},{"$f":"HLOOKUP(INDEX('Poules C - D'!$J$25:$M$25,MATCH(3,'Poules C - D'!$J$33:$M$33,0)),'Poules C - D'!$X$24:$AE$33,10,FALSE)","v":0.4370860927152318},null,"3C",{"$f":"VLOOKUP(INDEX('Poules C - D'!$J$8:$M$8,MATCH(3,'Poules C - D'!$J$16:$M$16,0)),'Poules C - D'!$A$3:$C$6,2,FALSE)","v":"Romain"},{"$f":"INDEX('Poules C - D'!$J$15:$M$15,MATCH(3,'Poules C - D'!$J$16:$M$16,0))","v":0},{"$f":"HLOOKUP(INDEX('Poules C - D'!$J$8:$M$8,MATCH(3,'Poules C - D'!$J$16:$M$16,0)),'Poules C - D'!$O$7:$V$16,10,FALSE)","v":0},{"$f":"HLOOKUP(INDEX('Poules C - D'!$J$8:$M$8,MATCH(3,'Poules C - D'!$J$16:$M$16,0)),'Poules C - D'!$X$7:$AE$16,10,FALSE)","v":0.36607142857142855}]
["3A",{"$f":"VLOOKUP(INDEX('Poules A - B'!$J$8:$M$8,MATCH(3,'Poules A - B'!$J$16:$M$16,0)),'Poules A - B'!$A$3:$C$6,2,FALSE)","v":"SebAZ"},{"$f":"INDEX('Poules A - B'!$J$15:$M$15,MATCH(3,'Poules A - B'!$J$16:$M$16,0))","v":0},{"$f":"HLOOKUP(INDEX('Poules A - B'!$J$8:$M$8,MATCH(3,'Poules A - B'!$J$16:$M$16,0)),'Poules A - B'!$O$7:$V$16,10,FALSE)","v":0.14285714285714285},{"$f":"HLOOKUP(INDEX('Poules A - B'!$J$8:$M$8,MATCH(3,'Poules A - B'!$J$16:$M$16,0)),'Poules A - B'!$X$7:$AE$16,10,FALSE)","v":0.40740740740740738},null,"3E",{"$f":"VLOOKUP(INDEX('Poules E - F'!$J$8:$M$8,MATCH(3,'Poules E - F'!$J$16:$M$16,0)),'Poules E - F'!$A$3:$C$6,2,FALSE)","v":"Axel"},{"$f":"INDEX('Poules E - F'!$J$15:$M$15,MATCH(3,'Poules E - F'!$J$16:$M$16,0))","v":0},{"$f":"HLOOKUP(INDEX('Poules E - F'!$J$8:$M$8,MATCH(3,'Poules E - F'!$J$16:$M$16,0)),'Poules E - F'!$O$7:$V$16,10,FALSE)","v":0},{"$f":"HLOOKUP(INDEX('Poules E - F'!$J$8:$M$8,MATCH(3,'Poules E - F'!$J$16:$M$16,0)),'Poules E - F'!$X$7:$AE$16,10,FALSE)","v":0.3125}]
["3C",{"$f":"VLOOKUP(INDEX('Poules C - D'!$J$8:$M$8,MATCH(3,'Poules C - D'!$J$16:$M$16,0)),'Poules C - D'!$A$3:$C$6,2,FALSE)","v":"Romain"},{"$f":"INDEX('Poules C - D'!$J$15:$M$15,MATCH(3,'Poules C - D'!$J$16:$M$16,0))","v":0},{"$f":"HLOOKUP(INDEX('Poules C - D'!$J$8:$M$8,MATCH(3,'Poules C - D'!$J$16:$M$16,0)),'Poules C - D'!$O$7:$V$16,10,FALSE)","v":0},{"$f":"HLOOKUP(INDEX('Poules C - D'!$J$8:$M$8,MATCH(3,'Poules C - D'!$J$16:$M$16,0)),'Poules C - D'!$X$7:$AE$16,10,FALSE)","v":0.36607142857142855},null,"3F",{"$f":"VLOOKUP(INDEX('Poules E - F'!$J$25:$M$25,MATCH(3,'Poules E - F'!$J$33:$M$33,0)),'Poules E - F'!$A$20:$C$23,2,FALSE)","v":"Jules"},{"$f":"INDEX('Poules E - F'!$J$32:$M$32,MATCH(3,'Poules E - F'!$J$33:$M$33,0))","v":0},{"$f":"HLOOKUP(INDEX('Poules E - F'!$J$25:$M$25,MATCH(3,'Poules E - F'!$J$33:$M$33,0)),'Poules E - F'!$O$24:$V$33,10,FALSE)","v":0},{"$f":"HLOOKUP(INDEX('Poules E - F'!$J$25:$M$25,MATCH(3,'Poules E - F'!$J$33:$M$33,0)),'Poules E - F'!$X$24:$AE$33,10,FALSE)","v":0.28260869565217389}]