{"text_format":"1","workbook":"xlsx","n_sheets":5,"sheets":["Tableau","Poules A - B","Poules C - D","Poules E - F","Feuil1"],"not_rendered":{"charts":0,"images":0,"macros":1,"external_links":0,"defined_names":8,"comments":0,"pivot_tables":0},"unopened":[],"bounds":{"document_bytes":16777216,"sheet_cells":100000,"rows_first":2000,"rows_last":500,"rows_between":2000,"halvings":0,"cell_chars":16384,"cell_head_chars":4096},"cells_cut":0,"cells_raw":0,"read":"whole","date_system":"1900"}

{"sheet":"Tableau","index":0,"n_rows":38,"n_cols":26,"rows_kept":38,"cut":false,"hidden":false,"merged":[[30,3,30,4],[22,8,23,8],[19,8,20,8],[16,8,17,8],[10,8,11,8],[4,8,5,8],[1,8,2,8],[6,25,18,27],[13,8,14,8],[25,0,25,2],[7,8,8,8]]}
["Rang","NOM Prénom","Points",null,"Pos","Poule A","Class.",null,null,null,"PRINCIPAL   1/8 F","Table",null,"1/4 F","Table",null,"1/2 F","Table",null,"Finale","Table",null,"Class.","Classement final",null,"ATTENTION, NE PAS LANCER DE 1/8 DE FINALE AVANT D'AVOIR :\n\n1) TERMINE LES POULES\n\n2) FAIT LE DEPARTAGE MANUEL DES EX AEQUO DANS LES POULES LE CAS ECHEANT\n\n3) CLIQUE SUR LE BOUTON MAJ CLT SERVANT A DETERMINER LES MEILLEURS 3E DE POULES"]
["1*","Lik",14,null,1,{"$f":"B2","v":"Lik"},{"$f":"INDEX('Poules A - B'!$J$16:$M$16,MATCH(Tableau!E2,'Poules A - B'!$J$8:$M$8,0))","v":1},{"$f":"IF(G2=\"\",\"\",G2&RIGHT($F$1,1))","v":"1A"},null,"1A",{"$f":"IF(ISNA(INDEX($F$2:$F$30,MATCH(J2,$H$2:$H$30,0))),\"\",INDEX($F$2:$F$30,MATCH(J2,$H$2:$H$30,0)))","v":"Lik"},"G","G",{"$f":"IF(L2=\"\",\"\",IF(L2=\"G\",K2,K3))","v":"Lik"},"G","G",{"$f":"IF(O2=\"\",\"\",IF(O2=\"G\",N2,N3))","v":"Lik"},"G","G",{"$f":"IF(R2=\"\",\"\",IF(R2=\"G\",Q2,Q3))","v":"Lik"},"P",null,1,{"$f":"IF(U2=\"\",\"\",IF(U2=\"G\",T2,T3))","v":"Zan"}]
["2*","Zan",13,null,2,{"$f":"B13","v":"Noël"},{"$f":"INDEX('Poules A - B'!$J$16:$M$16,MATCH(Tableau!E3,'Poules A - B'!$J$8:$M$8,0))","v":2},{"$f":"IF(G3=\"\",\"\",G3&RIGHT($F$1,1))","v":"2A"},null,"4e meill. 3e",{"$f":"B36","v":"Romain"},null,"G",{"$f":"IF(L5=\"\",\"\",IF(L5=\"G\",K5,K6))","v":"Maxime"},null,"G",{"$f":"IF(O5=\"\",\"\",IF(O5=\"G\",N5,N6))","v":"Sebden"},null,"G",{"$f":"IF(R5=\"\",\"\",IF(R5=\"G\",Q5,Q6))","v":"Zan"},null,null,2,{"$f":"IF(U2=\"\",\"\",IF(U2=\"P\",T2,T3))","v":"Lik"}]
["3*","Matthieu",11,null,3,{"$f":"B14","v":"SebAZ"},{"$f":"INDEX('Poules A - B'!$J$16:$M$16,MATCH(Tableau!E4,'Poules A - B'!$J$8:$M$8,0))","v":3},{"$f":"IF(G4=\"\",\"\",G4&RIGHT($F$1,1))","v":"3A"},null,null,null,null,null,null,null,null,null,null,null,"3 / 4",null,null,3,{"$f":"IF(U5=\"\",\"\",IF(U5=\"G\",T5,T6))","v":"Sebden"}]
["4*","Sebden",10,null,4,{"$f":"B25","v":0},{"$f":"INDEX('Poules A - B'!$J$16:$M$16,MATCH(Tableau!E5,'Poules A - B'!$J$8:$M$8,0))","v":4},{"$f":"IF(G5=\"\",\"\",G5&RIGHT($F$1,1))","v":"4A"},null,"2F",{"$f":"IF(ISNA(INDEX($F$2:$F$30,MATCH(J5,$H$2:$H$30,0))),\"\",INDEX($F$2:$F$30,MATCH(J5,$H$2:$H$30,0)))","v":"Maxime"},"G","G",{"$f":"IF(L8=\"\",\"\",IF(L8=\"G\",K8,K9))","v":"Tom"},"P","G",{"$f":"IF(O8=\"\",\"\",IF(O8=\"G\",N8,N9))","v":"Matthieu"},"P","P",{"$f":"IF(R2=\"\",\"\",IF(R2=\"P\",Q2,Q3))","v":"Sebden"},"G",null,4,{"$f":"IF(U5=\"\",\"\",IF(U5=\"P\",T5,T6))","v":"Matthieu"}]
["5*","Tom",9,null,null,"Poule B",null,null,null,"2B",{"$f":"IF(ISNA(INDEX($F$2:$F$30,MATCH(J6,$H$2:$H$30,0))),\"\",INDEX($F$2:$F$30,MATCH(J6,$H$2:$H$30,0)))","v":"Ariel"},null,"G",{"$f":"IF(L11=\"\",\"\",IF(L11=\"G\",K11,K12))","v":"Sebden"},null,"G",{"$f":"IF(O11=\"\",\"\",IF(O11=\"G\",N11,N12))","v":"Zan"},null,"P",{"$f":"IF(R5=\"\",\"\",IF(R5=\"P\",Q5,Q6))","v":"Matthieu"},null,null,5,{"$f":"IF(U8=\"\",\"\",IF(U8=\"G\",T8,T9))","v":"Tom"}]
["6*","Flo",8,null,1,{"$f":"B3","v":"Zan"},{"$f":"INDEX('Poules A - B'!$J$33:$M$33,MATCH(Tableau!E7,'Poules A - B'!$J$25:$M$25,0))","v":1},{"$f":"IF(G7=\"\",\"\",G7&RIGHT($F$6,1))","v":"1B"},null,null,null,null,null,null,null,null,"5 à 8",null,null,"5 / 6",null,null,6,{"$f":"IF(U8=\"\",\"\",IF(U8=\"P\",T8,T9))","v":"Flo"},null,"ATTENTION, NE PAS LANCER DE 1/8 DE FINALE AVANT D'AVOIR :\n\n1) TERMINE LES POULES\n\n2) FAIT LE DEPARTAGE MANUEL DES EX AEQUO DANS LES POULES LE CAS ECHEANT\n\n3) CLIQUE SUR LE BOUTON MAJ CLT SERVANT A DETERMINER LES MEILLEURS 3E DE POULES"]
[7,"Maxime",7,null,2,{"$f":"B12","v":"Ariel"},{"$f":"INDEX('Poules A - B'!$J$33:$M$33,MATCH(Tableau!E8,'Poules A - B'!$J$25:$M$25,0))","v":2},{"$f":"IF(G8=\"\",\"\",G8&RIGHT($F$6,1))","v":"2B"},null,"1E",{"$f":"IF(ISNA(INDEX($F$2:$F$30,MATCH(J8,$H$2:$H$30,0))),\"\",INDEX($F$2:$F$30,MATCH(J8,$H$2:$H$30,0)))","v":"Tom"},"G","G",{"$f":"IF(L14=\"\",\"\",IF(L14=\"G\",K14,K15))","v":"Matthieu"},"G","P",{"$f":"IF(O2=\"\",\"\",IF(O2=\"P\",N2,N3))","v":"Maxime"},"P","G",{"$f":"IF(R8=\"\",\"\",IF(R8=\"G\",Q8,Q9))","v":"Tom"},"G",null,7,{"$f":"IF(U11=\"\",\"\",IF(U11=\"G\",T11,T12))","v":"Maxime"}]
[8,"Val",7,null,3,{"$f":"B15","v":"Stephane"},{"$f":"INDEX('Poules A - B'!$J$33:$M$33,MATCH(Tableau!E9,'Poules A - B'!$J$25:$M$25,0))","v":3},{"$f":"IF(G9=\"\",\"\",G9&RIGHT($F$6,1))","v":"3B"},null,"2C","Axel",null,"G",{"$f":"IF(L17=\"\",\"\",IF(L17=\"G\",K17,K18))","v":"Flo"},null,"P",{"$f":"IF(O5=\"\",\"\",IF(O5=\"P\",N5,N6))","v":"Tom"},null,"G",{"$f":"IF(R11=\"\",\"\",IF(R11=\"G\",Q11,Q12))","v":"Flo"},null,null,8,{"$f":"IF(U11=\"\",\"\",IF(U11=\"P\",T11,T12))","v":"Noël"}]
[9,"Eric",7,null,4,{"$f":"B24","v":0},{"$f":"INDEX('Poules A - B'!$J$33:$M$33,MATCH(Tableau!E10,'Poules A - B'!$J$25:$M$25,0))","v":4},{"$f":"IF(G10=\"\",\"\",G10&RIGHT($F$6,1))","v":"4B"},null,null,null,null,null,null,null,null,null,null,null,"7 / 8",null,null,9,{"$f":"IF(U14=\"\",\"\",IF(U14=\"G\",T14,T15))","v":"Ariel"}]
[10,"KarineA",7,null,null,"Poule C",null,null,null,"Meill. 3e",{"$f":"B33","v":"Stephane"},"P","G",{"$f":"IF(L20=\"\",\"\",IF(L20=\"G\",K20,K21))","v":"Noël"},"P","P",{"$f":"IF(O8=\"\",\"\",IF(O8=\"P\",N8,N9))","v":"Flo"},"G","P",{"$f":"IF(R8=\"\",\"\",IF(R8=\"P\",Q8,Q9))","v":"Maxime"},"G",null,10,{"$f":"IF(U14=\"\",\"\",IF(U14=\"P\",T14,T15))","v":"SebAZ"}]
[11,"Ariel",6,null,1,{"$f":"B4","v":"Matthieu"},{"$f":"INDEX('Poules C - D'!$J$16:$M$16,MATCH(Tableau!E12,'Poules C - D'!$J$8:$M$8,0))","v":1},{"$f":"IF(G12=\"\",\"\",G12&RIGHT($F$11,1))","v":"1C"},null,"1D",{"$f":"IF(ISNA(INDEX($F$2:$F$30,MATCH(J12,$H$2:$H$30,0))),\"\",INDEX($F$2:$F$30,MATCH(J12,$H$2:$H$30,0)))","v":"Sebden"},null,"G",{"$f":"IF(L23=\"\",\"\",IF(L23=\"G\",K23,K24))","v":"Zan"},null,"P",{"$f":"IF(O11=\"\",\"\",IF(O11=\"P\",N11,N12))","v":"Noël"},null,"P",{"$f":"IF(R11=\"\",\"\",IF(R11=\"P\",Q11,Q12))","v":"Noël"},null,null,11,{"$f":"IF(U17=\"\",\"\",IF(U17=\"G\",T17,T18))","v":"Stephane"}]
[12,"Noël",6,null,2,{"$f":"B11","v":"KarineA"},{"$f":"INDEX('Poules C - D'!$J$16:$M$16,MATCH(Tableau!E13,'Poules C - D'!$J$8:$M$8,0))","v":2},{"$f":"IF(G13=\"\",\"\",G13&RIGHT($F$11,1))","v":"2C"},null,null,null,null,null,"9 à 16",null,null,"9 à 12",null,null,"9 / 10",null,null,12,{"$f":"IF(U17=\"\",\"\",IF(U17=\"P\",T17,T18))","v":"Eric"}]
[13,"SebAZ",5,null,3,{"$f":"B16","v":"Romain"},{"$f":"INDEX('Poules C - D'!$J$16:$M$16,MATCH(Tableau!E14,'Poules C - D'!$J$8:$M$8,0))","v":3},{"$f":"IF(G14=\"\",\"\",G14&RIGHT($F$11,1))","v":"3C"},null,"1C",{"$f":"IF(ISNA(INDEX($F$2:$F$30,MATCH(J14,$H$2:$H$30,0))),\"\",INDEX($F$2:$F$30,MATCH(J14,$H$2:$H$30,0)))","v":"Matthieu"},"G","P",{"$f":"IF(L2=\"\",\"\",IF(L2=\"P\",K2,K3))","v":"Romain"},"P","G",{"$f":"IF(O14=\"\",\"\",IF(O14=\"G\",N14,N15))","v":"Ariel"},"G","G",{"$f":"IF(R14=\"\",\"\",IF(R14=\"G\",Q14,Q15))","v":"Ariel"},"G",null,13,{"$f":"IF(U20=\"\",\"\",IF(U20=\"G\",T20,T21))","v":"Val"}]
[14,"Stephane",5,null,4,{"$f":"B23","v":0},{"$f":"INDEX('Poules C - D'!$J$16:$M$16,MATCH(Tableau!E15,'Poules C - D'!$J$8:$M$8,0))","v":4},{"$f":"IF(G15=\"\",\"\",G15&RIGHT($F$11,1))","v":"4C"},null,"2e meill. 3e",{"$f":"B34","v":"Eric"},null,"P",{"$f":"IF(L5=\"\",\"\",IF(L5=\"P\",K5,K6))","v":"Ariel"},null,"G",{"$f":"IF(O17=\"\",\"\",IF(O17=\"G\",N17,N18))","v":"Stephane"},null,"G",{"$f":"IF(R17=\"\",\"\",IF(R17=\"G\",Q17,Q18))","v":"SebAZ"},null,null,14,{"$f":"IF(U20=\"\",\"\",IF(U20=\"P\",T20,T21))","v":"Romain"}]
[15,"Romain",5,null,null,"Poule D",null,null,null,null,null,null,null,null,null,null,null,null,null,"11 / 12",null,null,15,{"$f":"IF(U23=\"\",\"\",IF(U23=\"G\",T23,T24))","v":"Axel"}]
[16,"Monique",5,null,1,{"$f":"B5","v":"Sebden"},{"$f":"INDEX('Poules C - D'!$J$33:$M$33,MATCH(Tableau!E17,'Poules C - D'!$J$25:$M$25,0))","v":1},{"$f":"IF(G17=\"\",\"\",G17&RIGHT($F$16,1))","v":"1D"},null,"2D",{"$f":"IF(ISNA(INDEX($F$2:$F$30,MATCH(J17,$H$2:$H$30,0))),\"\",INDEX($F$2:$F$30,MATCH(J17,$H$2:$H$30,0)))","v":"Monique"},"P","P",{"$f":"IF(L8=\"\",\"\",IF(L8=\"P\",K8,K9))","v":"Axel"},"P","G",{"$f":"IF(O20=\"\",\"\",IF(O20=\"G\",N20,N21))","v":"Eric"},"P","P",{"$f":"IF(R14=\"\",\"\",IF(R14=\"P\",Q14,Q15))","v":"Stephane"},"G",null,16,{"$f":"IF(U23=\"\",\"\",IF(U23=\"P\",T23,T24))","v":"Monique"}]
[17,"Axel",5,null,2,{"$f":"B10","v":"Eric"},{"$f":"INDEX('Poules C - D'!$J$33:$M$33,MATCH(Tableau!E18,'Poules C - D'!$J$25:$M$25,0))","v":3},{"$f":"IF(G18=\"\",\"\",G18&RIGHT($F$16,1))","v":"3D"},null,"1F",{"$f":"IF(ISNA(INDEX($F$2:$F$30,MATCH(J18,$H$2:$H$30,0))),\"\",INDEX($F$2:$F$30,MATCH(J18,$H$2:$H$30,0)))","v":"Flo"},null,"P",{"$f":"IF(L11=\"\",\"\",IF(L11=\"P\",K11,K12))","v":"Stephane"},null,"G",{"$f":"IF(O23=\"\",\"\",IF(O23=\"G\",N23,N24))","v":"SebAZ"},null,"P",{"$f":"IF(R17=\"\",\"\",IF(R17=\"P\",Q17,Q18))","v":"Eric"},null,null,17,{"$f":"IF(R27=\"\",\"\",IF(R27=\"G\",Q27,Q28))","v":"Benjamin"}]
[18,"Benjamin",5,null,3,{"$f":"B17","v":"Monique"},{"$f":"INDEX('Poules C - D'!$J$33:$M$33,MATCH(Tableau!E19,'Poules C - D'!$J$25:$M$25,0))","v":2},{"$f":"IF(G19=\"\",\"\",G19&RIGHT($F$16,1))","v":"2D"},null,null,null,null,null,null,null,null,"13 à 16",null,null,"13 / 14",null,null,18,{"$f":"IF(R27=\"\",\"\",IF(R27=\"P\",Q27,Q28))","v":"Jules"}]
[19,"Jules",5,null,4,{"$f":"B22","v":0},{"$f":"INDEX('Poules C - D'!$J$33:$M$33,MATCH(Tableau!E20,'Poules C - D'!$J$25:$M$25,0))","v":4},{"$f":"IF(G20=\"\",\"\",G20&RIGHT($F$16,1))","v":"4D"},null,"2E",{"$f":"IF(ISNA(INDEX($F$2:$F$30,MATCH(J20,$H$2:$H$30,0))),\"\",INDEX($F$2:$F$30,MATCH(J20,$H$2:$H$30,0)))","v":"Val"},"P","P",{"$f":"IF(L14=\"\",\"\",IF(L14=\"P\",K14,K15))","v":"Eric"},"g","P",{"$f":"IF(O14=\"\",\"\",IF(O14=\"P\",N14,N15))","v":"Romain"},"G","G",{"$f":"IF(R20=\"\",\"\",IF(R20=\"G\",Q20,Q21))","v":"Romain"},"P",null,19,{"$f":"IF(R30=\"\",\"\",IF(R30=\"G\",Q30,Q31))","v":"KarineLL"}]
[20,"KarineLL",5,null,null,"Poule E",null,null,null,"2A",{"$f":"IF(ISNA(INDEX($F$2:$F$30,MATCH(J21,$H$2:$H$30,0))),\"\",INDEX($F$2:$F$30,MATCH(J21,$H$2:$H$30,0)))","v":"Noël"},null,"P",{"$f":"IF(L17=\"\",\"\",IF(L17=\"P\",K17,K18))","v":"Monique"},null,"P",{"$f":"IF(O17=\"\",\"\",IF(O17=\"P\",N17,N18))","v":"Axel"},null,"G",{"$f":"IF(R23=\"\",\"\",IF(R23=\"G\",Q23,Q24))","v":"Val"},null,null,20]
[21,null,null,null,1,{"$f":"B6","v":"Tom"},{"$f":"INDEX('Poules E - F'!$J$16:$M$16,MATCH(Tableau!E22,'Poules E - F'!$J$8:$M$8,0))","v":1},{"$f":"IF(G22=\"\",\"\",G22&RIGHT($F$21,1))","v":"1E"},null,null,null,null,null,null,null,null,null,null,null,"15 / 16",null,null,21,{"$f":"IF(R33=\"\",\"\",IF(R33=\"G\",Q33,Q34))","v":""}]
[22,null,null,null,2,{"$f":"B9","v":"Val"},{"$f":"INDEX('Poules E - F'!$J$16:$M$16,MATCH(Tableau!E23,'Poules E - F'!$J$8:$M$8,0))","v":2},{"$f":"IF(G23=\"\",\"\",G23&RIGHT($F$21,1))","v":"2E"},null,"3e meill. 3e",{"$f":"B35","v":"SebAZ"},"P","P",{"$f":"IF(L20=\"\",\"\",IF(L20=\"P\",K20,K21))","v":"Val"},"P","P",{"$f":"IF(O20=\"\",\"\",IF(O20=\"P\",N20,N21))","v":"Monique"},"P","P",{"$f":"IF(R20=\"\",\"\",IF(R20=\"P\",Q20,Q21))","v":"Axel"},"G",null,22,{"$f":"IF(R33=\"\",\"\",IF(R33=\"P\",Q33,Q34))","v":""}]
[23,null,null,null,3,{"$f":"B18","v":"Axel"},{"$f":"INDEX('Poules E - F'!$J$16:$M$16,MATCH(Tableau!E24,'Poules E - F'!$J$8:$M$8,0))","v":3},{"$f":"IF(G24=\"\",\"\",G24&RIGHT($F$21,1))","v":"3E"},null,"1B",{"$f":"IF(ISNA(INDEX($F$2:$F$30,MATCH(J24,$H$2:$H$30,0))),\"\",INDEX($F$2:$F$30,MATCH(J24,$H$2:$H$30,0)))","v":"Zan"},null,"P",{"$f":"IF(L23=\"\",\"\",IF(L23=\"P\",K23,K24))","v":"SebAZ"},null,"P",{"$f":"IF(O23=\"\",\"\",IF(O23=\"P\",N23,N24))","v":"Val"},null,"P",{"$f":"IF(R23=\"\",\"\",IF(R23=\"P\",Q23,Q24))","v":"Monique"},null,null,23,{"$f":"IF(R36=\"\",\"\",IF(R36=\"G\",Q36,Q37))","v":""}]
[24,null,null,null,4,{"$f":"B21","v":"KarineLL"},{"$f":"INDEX('Poules E - F'!$J$16:$M$16,MATCH(Tableau!E25,'Poules E - F'!$J$8:$M$8,0))","v":4},{"$f":"IF(G25=\"\",\"\",G25&RIGHT($F$21,1))","v":"4E"},null,null,null,null,null,null,null,null,null,null,null,null,null,null,24,{"$f":"IF(R36=\"\",\"\",IF(R36=\"P\",Q36,Q37))","v":""}]
["SERPENT",null,null,null,null,"Poule F",null,null,null,null,"CONSOLANTE  17 à 24",null,null,"17 à 20",null,null,"17 / 18"]
["*","Tête de série",null,null,1,{"$f":"B7","v":"Flo"},{"$f":"INDEX('Poules E - F'!$J$33:$M$33,MATCH(Tableau!E27,'Poules E - F'!$J$25:$M$25,0))","v":1},{"$f":"IF(G27=\"\",\"\",G27&RIGHT($F$26,1))","v":"1F"},null,"4D",{"$f":"IF(ISNA(INDEX($F$2:$F$30,MATCH(J27,$H$2:$H$30,0))),\"\",INDEX($F$2:$F$30,MATCH(J27,$H$2:$H$30,0)))","v":0},"P","G","Jules","G","G","Jules","P"]
[null,null,null,null,2,{"$f":"B8","v":"Maxime"},{"$f":"INDEX('Poules E - F'!$J$33:$M$33,MATCH(Tableau!E28,'Poules E - F'!$J$25:$M$25,0))","v":2},{"$f":"IF(G28=\"\",\"\",G28&RIGHT($F$26,1))","v":"2F"},null,"5e meill. 3e",null,null,"G","KarineLL",null,"G","Benjamin"]
[null,null,null,null,3,{"$f":"B19","v":"Benjamin"},{"$f":"INDEX('Poules E - F'!$J$33:$M$33,MATCH(Tableau!E29,'Poules E - F'!$J$25:$M$25,0))","v":4},{"$f":"IF(G29=\"\",\"\",G29&RIGHT($F$26,1))","v":"4F"},null,null,null,null,null,null,null,null,"19 / 20"]
[null,null,null,null,4,{"$f":"B20","v":"Jules"},{"$f":"INDEX('Poules E - F'!$J$33:$M$33,MATCH(Tableau!E30,'Poules E - F'!$J$25:$M$25,0))","v":3},{"$f":"IF(G30=\"\",\"\",G30&RIGHT($F$26,1))","v":"3F"},null,"4F",{"$f":"IF(ISNA(INDEX($F$2:$F$30,MATCH(J30,$H$2:$H$30,0))),\"\",INDEX($F$2:$F$30,MATCH(J30,$H$2:$H$30,0)))","v":"Benjamin"},"G","G","Benjamin","G","P","KarineLL","G"]
[null,null,null,"% gagnés",null,null,null,null,null,"4A",{"$f":"IF(ISNA(INDEX($F$2:$F$30,MATCH(J31,$H$2:$H$30,0))),\"\",INDEX($F$2:$F$30,MATCH(J31,$H$2:$H$30,0)))","v":0},null,"G","KarineLL",null,"P",{"$f":"IF(O30=\"\",\"\",IF(O30=\"P\",N30,N31))","v":"KarineLL"}]
[null,null,"Pts","sets","pts","Classement",null,null,null,null,null,null,null,"21 à 24",null,null,"21 / 22"]
["3B",{"$f":"VLOOKUP(INDEX('Poules A - B'!$J$25:$M$25,MATCH(3,'Poules A - B'!$J$33:$M$33,0)),'Poules A - B'!$A$20:$C$23,2,FALSE)","v":"Stephane"},{"$f":"INDEX('Poules A - B'!$J$32:$M$32,MATCH(3,'Poules A - B'!$J$33:$M$33,0))","v":0},{"$f":"HLOOKUP(INDEX('Poules A - B'!$J$25:$M$25,MATCH(3,'Poules A - B'!$J$33:$M$33,0)),'Poules A - B'!$O$24:$V$33,10,FALSE)","v":0.33333333333333331},{"$f":"HLOOKUP(INDEX('Poules A - B'!$J$25:$M$25,MATCH(3,'Poules A - B'!$J$33:$M$33,0)),'Poules A - B'!$X$24:$AE$33,10,FALSE)","v":0.44},1,null,null,null,"4B",{"$f":"IF(ISNA(INDEX($F$2:$F$30,MATCH(J33,$H$2:$H$30,0))),\"\",INDEX($F$2:$F$30,MATCH(J33,$H$2:$H$30,0)))","v":0},"P","P",{"$f":"IF(L27=\"\",\"\",IF(L27=\"P\",K27,K28))","v":0},null,"G",{"$f":"IF(O33=\"\",\"\",IF(O33=\"G\",N33,N34))","v":""}]
["3D",{"$f":"VLOOKUP(INDEX('Poules C - D'!$J$25:$M$25,MATCH(3,'Poules C - D'!$J$33:$M$33,0)),'Poules C - D'!$A$20:$C$23,2,FALSE)","v":"Eric"},{"$f":"INDEX('Poules C - D'!$J$32:$M$32,MATCH(3,'Poules C - D'!$J$33:$M$33,0))","v":0},{"$f":"HLOOKUP(INDEX('Poules C - D'!$J$25:$M$25,MATCH(3,'Poules C - D'!$J$33:$M$33,0)),'Poules C - D'!$O$24:$V$33,10,FALSE)","v":0.25},{"$f":"HLOOKUP(INDEX('Poules C - D'!$J$25:$M$25,MATCH(3,'Poules C - D'!$J$33:$M$33,0)),'Poules C - D'!$X$24:$AE$33,10,FALSE)","v":0.4370860927152318},2,null,null,null,"4E",{"$f":"IF(ISNA(INDEX($F$2:$F$30,MATCH(J34,$H$2:$H$30,0))),\"\",INDEX($F$2:$F$30,MATCH(J34,$H$2:$H$30,0)))","v":"KarineLL"},null,"P",{"$f":"IF(L30=\"\",\"\",IF(L30=\"P\",K30,K31))","v":0},null,"G",{"$f":"IF(O36=\"\",\"\",IF(O36=\"G\",N36,N37))","v":""}]
["3A",{"$f":"VLOOKUP(INDEX('Poules A - B'!$J$8:$M$8,MATCH(3,'Poules A - B'!$J$16:$M$16,0)),'Poules A - B'!$A$3:$C$6,2,FALSE)","v":"SebAZ"},{"$f":"INDEX('Poules A - B'!$J$15:$M$15,MATCH(3,'Poules A - B'!$J$16:$M$16,0))","v":0},{"$f":"HLOOKUP(INDEX('Poules A - B'!$J$8:$M$8,MATCH(3,'Poules A - B'!$J$16:$M$16,0)),'Poules A - B'!$O$7:$V$16,10,FALSE)","v":0.14285714285714285},{"$f":"HLOOKUP(INDEX('Poules A - B'!$J$8:$M$8,MATCH(3,'Poules A - B'!$J$16:$M$16,0)),'Poules A - B'!$X$7:$AE$16,10,FALSE)","v":0.40740740740740738},3,null,null,null,null,null,null,null,null,null,null,"23 /24"]
["3C",{"$f":"VLOOKUP(INDEX('Poules C - D'!$J$8:$M$8,MATCH(3,'Poules C - D'!$J$16:$M$16,0)),'Poules C - D'!$A$3:$C$6,2,FALSE)","v":"Romain"},{"$f":"INDEX('Poules C - D'!$J$15:$M$15,MATCH(3,'Poules C - D'!$J$16:$M$16,0))","v":0},{"$f":"HLOOKUP(INDEX('Poules C - D'!$J$8:$M$8,MATCH(3,'Poules C - D'!$J$16:$M$16,0)),'Poules C - D'!$O$7:$V$16,10,FALSE)","v":0},{"$f":"HLOOKUP(INDEX('Poules C - D'!$J$8:$M$8,MATCH(3,'Poules C - D'!$J$16:$M$16,0)),'Poules C - D'!$X$7:$AE$16,10,FALSE)","v":0.36607142857142855},4,null,null,null,"6e meill. 3e",{"$f":"B38","v":"Jules"},"G","P",{"$f":"IF(L33=\"\",\"\",IF(L33=\"P\",K33,K34))","v":0},null,"P",{"$f":"IF(O33=\"\",\"\",IF(O33=\"P\",N33,N34))","v":""}]
["3E",{"$f":"VLOOKUP(INDEX('Poules E - F'!$J$8:$M$8,MATCH(3,'Poules E - F'!$J$16:$M$16,0)),'Poules E - F'!$A$3:$C$6,2,FALSE)","v":"Axel"},{"$f":"INDEX('Poules E - F'!$J$15:$M$15,MATCH(3,'Poules E - F'!$J$16:$M$16,0))","v":0},{"$f":"HLOOKUP(INDEX('Poules E - F'!$J$8:$M$8,MATCH(3,'Poules E - F'!$J$16:$M$16,0)),'Poules E - F'!$O$7:$V$16,10,FALSE)","v":0},{"$f":"HLOOKUP(INDEX('Poules E - F'!$J$8:$M$8,MATCH(3,'Poules E - F'!$J$16:$M$16,0)),'Poules E - F'!$X$7:$AE$16,10,FALSE)","v":0.3125},5,null,null,null,"4C",{"$f":"IF(ISNA(INDEX($F$2:$F$30,MATCH(J37,$H$2:$H$30,0))),\"\",INDEX($F$2:$F$30,MATCH(J37,$H$2:$H$30,0)))","v":0},null,"P",{"$f":"IF(L36=\"\",\"\",IF(L36=\"P\",K36,K37))","v":0},null,"P",{"$f":"IF(O36=\"\",\"\",IF(O36=\"P\",N36,N37))","v":""}]
["3F",{"$f":"VLOOKUP(INDEX('Poules E - F'!$J$25:$M$25,MATCH(3,'Poules E - F'!$J$33:$M$33,0)),'Poules E - F'!$A$20:$C$23,2,FALSE)","v":"Jules"},{"$f":"INDEX('Poules E - F'!$J$32:$M$32,MATCH(3,'Poules E - F'!$J$33:$M$33,0))","v":0},{"$f":"HLOOKUP(INDEX('Poules E - F'!$J$25:$M$25,MATCH(3,'Poules E - F'!$J$33:$M$33,0)),'Poules E - F'!$O$24:$V$33,10,FALSE)","v":0},{"$f":"HLOOKUP(INDEX('Poules E - F'!$J$25:$M$25,MATCH(3,'Poules E - F'!$J$33:$M$33,0)),'Poules E - F'!$X$24:$AE$33,10,FALSE)","v":0.28260869565217389},6]

{"sheet":"Poules A - B","index":1,"n_rows":33,"n_cols":31,"rows_kept":33,"cut":false,"hidden":false,"merged":[[1,1,1,2],[18,1,18,2],[17,8,19,11],[0,8,2,11],[22,1,22,2],[2,1,2,2],[3,1,3,2],[4,1,4,2],[5,1,5,2],[24,4,24,8],[7,4,7,8],[19,1,19,2],[20,1,20,2],[21,1,21,2],[6,14,6,15],[6,16,6,17],[6,18,6,19],[6,20,6,21],[15,14,15,15],[15,16,15,17],[15,18,15,19],[15,20,15,21],[23,14,23,15],[23,16,23,17],[23,18,23,19],[23,20,23,21],[32,14,32,15],[32,16,32,17],[32,18,32,19],[32,20,32,21],[6,23,6,24],[6,25,6,26],[6,27,6,28],[6,29,6,30],[15,23,15,24],[15,25,15,26],[15,27,15,28],[15,29,15,30],[23,23,23,24],[23,25,23,26],[23,27,23,28],[23,29,23,30],[32,23,32,24],[32,25,32,26],[32,27,32,28],[32,29,32,30]]}
["POULE","A"]
[null,"NOM Prénom",null,"Clt",null,null,null,"TABLE"]
[1,{"$f":"Tableau!F2","v":"Lik"},null,1]
[2,{"$f":"Tableau!F3","v":"Noël"},null,2]
[3,{"$f":"Tableau!F4","v":"SebAZ"},null,3]
[4,{"$f":"Tableau!F5","v":0},null,4,null,null,null,null,null,null,null,null,null,"Sets",null,null,null,null,null,null,null,null,"Pts"]
[null,null,null,null,null,null,null,null,null,null,null,null,"1 pour victoire - 0 pour défaite",null,1,null,2,null,3,null,4,null,null,1,null,2,null,3,null,4]
[null,"Nom Prénom","Nom Prénom","Table","Scores",null,null,null,null,1,2,3,4,null,"G","P","G","P","G","P","G","P",null,"G","P","G","P","G","P","G","P"]
["1 contre 4",{"$f":"B3","v":"Lik"},{"$f":"B6","v":0},null,null,null,null,null,null,{"$f":"IF(SUM($E9:$I9)=0,0,IF(COUNTIF($E9:$I9,\">0\")-COUNTIF($E9:$I9,\"<0\")>0,1,0))","v":0},null,null,{"$f":"IF(SUM($E9:$I9)=0,0,IF(COUNTIF($E9:$I9,\">0\")-COUNTIF($E9:$I9,\"<0\")<0,1,0))","v":0},null,{"$f":"COUNTIF($E9:$I9,\">0\")","v":0},{"$f":"COUNTIF($E9:$I9,\"<0\")","v":0},null,null,null,null,{"$f":"P9","v":0},{"$f":"O9","v":0},null,{"$f":"IF(ISBLANK($E9),0,IF($E9<0,-$E9,IF($E9>9,$E9+2,11)))+IF(ISBLANK($F9),0,IF($F9<0,-$F9,IF($F9>9,$F9+2,11)))+IF(ISBLANK($G9),0,IF($G9<0,-$G9,IF($G9>9,$G9+2,11)))+IF(ISBLANK($H9),0,IF($H9<0,-$H9,IF($H9>9,$H9+2,11)))+IF(ISBLANK($I9),0,IF($I9<0,-$I9,IF($I9>9,$I9+2,11)))","v":0},{"$f":"IF(ISBLANK($E9),0,IF($E9>0,$E9,IF($E9<-9,-$E9+2,11)))+IF(ISBLANK($F9),0,IF($F9>0,$F9,IF($F9<-9,-$F9+2,11)))+IF(ISBLANK($G9),0,IF($G9>0,$G9,IF($G9<-9,-$G9+2,11)))+IF(ISBLANK($H9),0,IF($H9>0,$H9,IF($H9<-9,-$H9+2,11)))+IF(ISBLANK($I9),0,IF($I9>0,$I9,IF($I9<-9,-$I9+2,11)))","v":0},null,null,null,null,{"$f":"Y9","v":0},{"$f":"X9","v":0}]
["2 contre 3",{"$f":"B4","v":"Noël"},{"$f":"B5","v":"SebAZ"},1,11,3,-10,7,null,null,{"$f":"IF(SUM($E10:$I10)=0,0,IF(COUNTIF($E10:$I10,\">0\")-COUNTIF($E10:$I10,\"<0\")>0,1,0))","v":1},{"$f":"IF(SUM($E10:$I10)=0,0,IF(COUNTIF($E10:$I10,\">0\")-COUNTIF($E10:$I10,\"<0\")<0,1,0))","v":0},null,null,null,null,{"$f":"COUNTIF($E10:$I10,\">0\")","v":3},{"$f":"COUNTIF($E10:$I10,\"<0\")","v":1},{"$f":"+R10","v":1},{"$f":"+Q10","v":3},null,null,null,null,null,{"$f":"IF(ISBLANK($E10),0,IF($E10<0,-$E10,IF($E10>9,$E10+2,11)))+IF(ISBLANK($F10),0,IF($F10<0,-$F10,IF($F10>9,$F10+2,11)))+IF(ISBLANK($G10),0,IF($G10<0,-$G10,IF($G10>9,$G10+2,11)))+IF(ISBLANK($H10),0,IF($H10<0,-$H10,IF($H10>9,$H10+2,11)))+IF(ISBLANK($I10),0,IF($I10<0,-$I10,IF($I10>9,$I10+2,11)))","v":45},{"$f":"IF(ISBLANK($E10),0,IF($E10>0,$E10,IF($E10<-9,-$E10+2,11)))+IF(ISBLANK($F10),0,IF($F10>0,$F10,IF($F10<-9,-$F10+2,11)))+IF(ISBLANK($G10),0,IF($G10>0,$G10,IF($G10<-9,-$G10+2,11)))+IF(ISBLANK($H10),0,IF($H10>0,$H10,IF($H10<-9,-$H10+2,11)))+IF(ISBLANK($I10),0,IF($I10>0,$I10,IF($I10<-9,-$I10+2,11)))","v":33},{"$f":"+AA10","v":33},{"$f":"+Z10","v":45}]
["1 contre 3",{"$f":"B3","v":"Lik"},{"$f":"B5","v":"SebAZ"},1,7,11,4,null,null,{"$f":"IF(SUM($E11:$I11)=0,0,IF(COUNTIF($E11:$I11,\">0\")-COUNTIF($E11:$I11,\"<0\")>0,1,0))","v":1},null,{"$f":"IF(SUM($E11:$I11)=0,0,IF(COUNTIF($E11:$I11,\">0\")-COUNTIF($E11:$I11,\"<0\")<0,1,0))","v":0},null,null,{"$f":"COUNTIF($E11:$I11,\">0\")","v":3},{"$f":"COUNTIF($E11:$I11,\"<0\")","v":0},null,null,{"$f":"+P11","v":0},{"$f":"+O11","v":3},null,null,null,{"$f":"IF(ISBLANK($E11),0,IF($E11<0,-$E11,IF($E11>9,$E11+2,11)))+IF(ISBLANK($F11),0,IF($F11<0,-$F11,IF($F11>9,$F11+2,11)))+IF(ISBLANK($G11),0,IF($G11<0,-$G11,IF($G11>9,$G11+2,11)))+IF(ISBLANK($H11),0,IF($H11<0,-$H11,IF($H11>9,$H11+2,11)))+IF(ISBLANK($I11),0,IF($I11<0,-$I11,IF($I11>9,$I11+2,11)))","v":35},{"$f":"IF(ISBLANK($E11),0,IF($E11>0,$E11,IF($E11<-9,-$E11+2,11)))+IF(ISBLANK($F11),0,IF($F11>0,$F11,IF($F11<-9,-$F11+2,11)))+IF(ISBLANK($G11),0,IF($G11>0,$G11,IF($G11<-9,-$G11+2,11)))+IF(ISBLANK($H11),0,IF($H11>0,$H11,IF($H11<-9,-$H11+2,11)))+IF(ISBLANK($I11),0,IF($I11>0,$I11,IF($I11<-9,-$I11+2,11)))","v":22},null,null,{"$f":"+Y11","v":22},{"$f":"+X11","v":35}]
["2 contre 4",{"$f":"B4","v":"Noël"},{"$f":"B6","v":0},null,null,null,null,null,null,null,{"$f":"IF(SUM($E12:$I12)=0,0,IF(COUNTIF($E12:$I12,\">0\")-COUNTIF($E12:$I12,\"<0\")>0,1,0))","v":0},null,{"$f":"IF(SUM($E12:$I12)=0,0,IF(COUNTIF($E12:$I12,\">0\")-COUNTIF($E12:$I12,\"<0\")<0,1,0))","v":0},null,null,null,{"$f":"COUNTIF($E12:$I12,\">0\")","v":0},{"$f":"COUNTIF($E12:$I12,\"<0\")","v":0},null,null,{"$f":"+R12","v":0},{"$f":"+Q12","v":0},null,null,null,{"$f":"IF(ISBLANK($E12),0,IF($E12<0,-$E12,IF($E12>9,$E12+2,11)))+IF(ISBLANK($F12),0,IF($F12<0,-$F12,IF($F12>9,$F12+2,11)))+IF(ISBLANK($G12),0,IF($G12<0,-$G12,IF($G12>9,$G12+2,11)))+IF(ISBLANK($H12),0,IF($H12<0,-$H12,IF($H12>9,$H12+2,11)))+IF(ISBLANK($I12),0,IF($I12<0,-$I12,IF($I12>9,$I12+2,11)))","v":0},{"$f":"IF(ISBLANK($E12),0,IF($E12>0,$E12,IF($E12<-9,-$E12+2,11)))+IF(ISBLANK($F12),0,IF($F12>0,$F12,IF($F12<-9,-$F12+2,11)))+IF(ISBLANK($G12),0,IF($G12>0,$G12,IF($G12<-9,-$G12+2,11)))+IF(ISBLANK($H12),0,IF($H12>0,$H12,IF($H12<-9,-$H12+2,11)))+IF(ISBLANK($I12),0,IF($I12>0,$I12,IF($I12<-9,-$I12+2,11)))","v":0},null,null,{"$f":"+AA12","v":0},{"$f":"+Z12","v":0}]
["1 contre 2",{"$f":"B3","v":"Lik"},{"$f":"B4","v":"Noël"},1,7,7,6,null,null,{"$f":"IF(SUM($E13:$I13)=0,0,IF(COUNTIF($E13:$I13,\">0\")-COUNTIF($E13:$I13,\"<0\")>0,1,0))","v":1},{"$f":"IF(SUM($E13:$I13)=0,0,IF(COUNTIF($E13:$I13,\">0\")-COUNTIF($E13:$I13,\"<0\")<0,1,0))","v":0},null,null,null,{"$f":"COUNTIF($E13:$I13,\">0\")","v":3},{"$f":"COUNTIF($E13:$I13,\"<0\")","v":0},{"$f":"+P13","v":0},{"$f":"+O13","v":3},null,null,null,null,null,{"$f":"IF(ISBLANK($E13),0,IF($E13<0,-$E13,IF($E13>9,$E13+2,11)))+IF(ISBLANK($F13),0,IF($F13<0,-$F13,IF($F13>9,$F13+2,11)))+IF(ISBLANK($G13),0,IF($G13<0,-$G13,IF($G13>9,$G13+2,11)))+IF(ISBLANK($H13),0,IF($H13<0,-$H13,IF($H13>9,$H13+2,11)))+IF(ISBLANK($I13),0,IF($I13<0,-$I13,IF($I13>9,$I13+2,11)))","v":33},{"$f":"IF(ISBLANK($E13),0,IF($E13>0,$E13,IF($E13<-9,-$E13+2,11)))+IF(ISBLANK($F13),0,IF($F13>0,$F13,IF($F13<-9,-$F13+2,11)))+IF(ISBLANK($G13),0,IF($G13>0,$G13,IF($G13<-9,-$G13+2,11)))+IF(ISBLANK($H13),0,IF($H13>0,$H13,IF($H13<-9,-$H13+2,11)))+IF(ISBLANK($I13),0,IF($I13>0,$I13,IF($I13<-9,-$I13+2,11)))","v":20},{"$f":"+Y13","v":20},{"$f":"+X13","v":33}]
["3 contre 4",{"$f":"B5","v":"SebAZ"},{"$f":"B6","v":0},null,null,null,null,null,null,null,null,{"$f":"IF(SUM($E14:$I14)=0,0,IF(COUNTIF($E14:$I14,\">0\")-COUNTIF($E14:$I14,\"<0\")>0,1,0))","v":0},{"$f":"IF(SUM($E14:$I14)=0,0,IF(COUNTIF($E14:$I14,\">0\")-COUNTIF($E14:$I14,\"<0\")<0,1,0))","v":0},null,null,null,null,null,{"$f":"COUNTIF($E14:$I14,\">0\")","v":0},{"$f":"COUNTIF($E14:$I14,\"<0\")","v":0},{"$f":"+T14","v":0},{"$f":"+S14","v":0},null,null,null,null,null,{"$f":"IF(ISBLANK($E14),0,IF($E14<0,-$E14,IF($E14>9,$E14+2,11)))+IF(ISBLANK($F14),0,IF($F14<0,-$F14,IF($F14>9,$F14+2,11)))+IF(ISBLANK($G14),0,IF($G14<0,-$G14,IF($G14>9,$G14+2,11)))+IF(ISBLANK($H14),0,IF($H14<0,-$H14,IF($H14>9,$H14+2,11)))+IF(ISBLANK($I14),0,IF($I14<0,-$I14,IF($I14>9,$I14+2,11)))","v":0},{"$f":"IF(ISBLANK($E14),0,IF($E14>0,$E14,IF($E14<-9,-$E14+2,11)))+IF(ISBLANK($F14),0,IF($F14>0,$F14,IF($F14<-9,-$F14+2,11)))+IF(ISBLANK($G14),0,IF($G14>0,$G14,IF($G14<-9,-$G14+2,11)))+IF(ISBLANK($H14),0,IF($H14>0,$H14,IF($H14<-9,-$H14+2,11)))+IF(ISBLANK($I14),0,IF($I14>0,$I14,IF($I14<-9,-$I14+2,11)))","v":0},{"$f":"+AC14","v":0},{"$f":"+AB14","v":0}]
[null,null,null,null,null,null,null,null,"Total",{"$f":"SUM(J9:J14)","v":2},{"$f":"SUM(K9:K14)","v":1},{"$f":"SUM(L9:L14)","v":0},{"$f":"SUM(M9:M14)","v":0},null,{"$f":"SUM(O9:O14)","v":6},0,3,4,1,6,0,0,null,{"$f":"SUM(X9:X14)","v":68},42,65,66,55,80,0,0]
[null,null,null,null,null,null,null,null,"Classement",1,2,3,4,null,{"$f":"IFERROR(O15/(O15+P15),0)","v":1},null,{"$f":"IFERROR(Q15/(Q15+R15),0)","v":0.42857142857142855},null,{"$f":"IFERROR(S15/(S15+T15),0)","v":0.14285714285714285},null,{"$f":"IFERROR(U15/(U15+V15),0)","v":0},null,null,{"$f":"IFERROR(X15/(X15+Y15),0)","v":0.61818181818181817},null,{"$f":"IFERROR(Z15/(Z15+AA15),0)","v":0.49618320610687022},null,{"$f":"IFERROR(AB15/(AB15+AC15),0)","v":0.40740740740740738},null,{"$f":"IFERROR(AD15/(AD15+AE15),0)","v":0}]
[]
["POULE","B"]
[null,"NOM Prénom",null,"Clt",null,null,null,"TABLE"]
[1,{"$f":"Tableau!F7","v":"Zan"},null,1]
[2,{"$f":"Tableau!F8","v":"Ariel"},null,2]
[3,{"$f":"Tableau!F9","v":"Stephane"},null,3]
[4,{"$f":"Tableau!F10","v":0},null,4,null,null,null,null,null,null,null,null,null,"Sets",null,null,null,null,null,null,null,null,"Pts"]
[null,null,null,null,null,null,null,null,null,null,null,null,"1 pour victoire - 0 pour défaite",null,1,null,2,null,3,null,4,null,null,1,null,2,null,3,null,4]
[null,"Nom Prénom","Nom Prénom","Table","Scores",null,null,null,null,1,2,3,4,null,"G","P","G","P","G","P","G","P",null,"G","P","G","P","G","P","G","P"]
["1 contre 4",{"$f":"B20","v":"Zan"},{"$f":"B23","v":0},null,null,null,null,null,null,{"$f":"IF(SUM($E26:$I26)=0,0,IF(COUNTIF($E26:$I26,\">0\")-COUNTIF($E26:$I26,\"<0\")>0,1,0))","v":0},null,null,{"$f":"IF(SUM($E26:$I26)=0,0,IF(COUNTIF($E26:$I26,\">0\")-COUNTIF($E26:$I26,\"<0\")<0,1,0))","v":0},null,{"$f":"COUNTIF($E26:$I26,\">0\")","v":0},{"$f":"COUNTIF($E26:$I26,\"<0\")","v":0},null,null,null,null,{"$f":"P26","v":0},{"$f":"O26","v":0},null,{"$f":"IF(ISBLANK($E26),0,IF($E26<0,-$E26,IF($E26>9,$E26+2,11)))+IF(ISBLANK($F26),0,IF($F26<0,-$F26,IF($F26>9,$F26+2,11)))+IF(ISBLANK($G26),0,IF($G26<0,-$G26,IF($G26>9,$G26+2,11)))+IF(ISBLANK($H26),0,IF($H26<0,-$H26,IF($H26>9,$H26+2,11)))+IF(ISBLANK($I26),0,IF($I26<0,-$I26,IF($I26>9,$I26+2,11)))","v":0},{"$f":"IF(ISBLANK($E26),0,IF($E26>0,$E26,IF($E26<-9,-$E26+2,11)))+IF(ISBLANK($F26),0,IF($F26>0,$F26,IF($F26<-9,-$F26+2,11)))+IF(ISBLANK($G26),0,IF($G26>0,$G26,IF($G26<-9,-$G26+2,11)))+IF(ISBLANK($H26),0,IF($H26>0,$H26,IF($H26<-9,-$H26+2,11)))+IF(ISBLANK($I26),0,IF($I26>0,$I26,IF($I26<-9,-$I26+2,11)))","v":0},null,null,null,null,{"$f":"Y26","v":0},{"$f":"X26","v":0}]
["2 contre 3",{"$f":"B21","v":"Ariel"},{"$f":"B22","v":"Stephane"},null,13,-9,5,-11,8,null,{"$f":"IF(SUM($E27:$I27)=0,0,IF(COUNTIF($E27:$I27,\">0\")-COUNTIF($E27:$I27,\"<0\")>0,1,0))","v":1},{"$f":"IF(SUM($E27:$I27)=0,0,IF(COUNTIF($E27:$I27,\">0\")-COUNTIF($E27:$I27,\"<0\")<0,1,0))","v":0},null,null,null,null,{"$f":"COUNTIF($E27:$I27,\">0\")","v":3},{"$f":"COUNTIF($E27:$I27,\"<0\")","v":2},{"$f":"+R27","v":2},{"$f":"+Q27","v":3},null,null,null,null,null,{"$f":"IF(ISBLANK($E27),0,IF($E27<0,-$E27,IF($E27>9,$E27+2,11)))+IF(ISBLANK($F27),0,IF($F27<0,-$F27,IF($F27>9,$F27+2,11)))+IF(ISBLANK($G27),0,IF($G27<0,-$G27,IF($G27>9,$G27+2,11)))+IF(ISBLANK($H27),0,IF($H27<0,-$H27,IF($H27>9,$H27+2,11)))+IF(ISBLANK($I27),0,IF($I27<0,-$I27,IF($I27>9,$I27+2,11)))","v":57},{"$f":"IF(ISBLANK($E27),0,IF($E27>0,$E27,IF($E27<-9,-$E27+2,11)))+IF(ISBLANK($F27),0,IF($F27>0,$F27,IF($F27<-9,-$F27+2,11)))+IF(ISBLANK($G27),0,IF($G27>0,$G27,IF($G27<-9,-$G27+2,11)))+IF(ISBLANK($H27),0,IF($H27>0,$H27,IF($H27<-9,-$H27+2,11)))+IF(ISBLANK($I27),0,IF($I27>0,$I27,IF($I27<-9,-$I27+2,11)))","v":50},{"$f":"+AA27","v":50},{"$f":"+Z27","v":57}]
["1 contre 3",{"$f":"B20","v":"Zan"},{"$f":"B22","v":"Stephane"},null,8,5,-8,3,null,{"$f":"IF(SUM($E28:$I28)=0,0,IF(COUNTIF($E28:$I28,\">0\")-COUNTIF($E28:$I28,\"<0\")>0,1,0))","v":1},null,{"$f":"IF(SUM($E28:$I28)=0,0,IF(COUNTIF($E28:$I28,\">0\")-COUNTIF($E28:$I28,\"<0\")<0,1,0))","v":0},null,null,{"$f":"COUNTIF($E28:$I28,\">0\")","v":3},{"$f":"COUNTIF($E28:$I28,\"<0\")","v":1},null,null,{"$f":"+P28","v":1},{"$f":"+O28","v":3},null,null,null,{"$f":"IF(ISBLANK($E28),0,IF($E28<0,-$E28,IF($E28>9,$E28+2,11)))+IF(ISBLANK($F28),0,IF($F28<0,-$F28,IF($F28>9,$F28+2,11)))+IF(ISBLANK($G28),0,IF($G28<0,-$G28,IF($G28>9,$G28+2,11)))+IF(ISBLANK($H28),0,IF($H28<0,-$H28,IF($H28>9,$H28+2,11)))+IF(ISBLANK($I28),0,IF($I28<0,-$I28,IF($I28>9,$I28+2,11)))","v":41},{"$f":"IF(ISBLANK($E28),0,IF($E28>0,$E28,IF($E28<-9,-$E28+2,11)))+IF(ISBLANK($F28),0,IF($F28>0,$F28,IF($F28<-9,-$F28+2,11)))+IF(ISBLANK($G28),0,IF($G28>0,$G28,IF($G28<-9,-$G28+2,11)))+IF(ISBLANK($H28),0,IF($H28>0,$H28,IF($H28<-9,-$H28+2,11)))+IF(ISBLANK($I28),0,IF($I28>0,$I28,IF($I28<-9,-$I28+2,11)))","v":27},null,null,{"$f":"+Y28","v":27},{"$f":"+X28","v":41}]
["2 contre 4",{"$f":"B21","v":"Ariel"},{"$f":"B23","v":0},null,null,null,null,null,null,null,{"$f":"IF(SUM($E29:$I29)=0,0,IF(COUNTIF($E29:$I29,\">0\")-COUNTIF($E29:$I29,\"<0\")>0,1,0))","v":0},null,{"$f":"IF(SUM($E29:$I29)=0,0,IF(COUNTIF($E29:$I29,\">0\")-COUNTIF($E29:$I29,\"<0\")<0,1,0))","v":0},null,null,null,{"$f":"COUNTIF($E29:$I29,\">0\")","v":0},{"$f":"COUNTIF($E29:$I29,\"<0\")","v":0},null,null,{"$f":"+R29","v":0},{"$f":"+Q29","v":0},null,null,null,{"$f":"IF(ISBLANK($E29),0,IF($E29<0,-$E29,IF($E29>9,$E29+2,11)))+IF(ISBLANK($F29),0,IF($F29<0,-$F29,IF($F29>9,$F29+2,11)))+IF(ISBLANK($G29),0,IF($G29<0,-$G29,IF($G29>9,$G29+2,11)))+IF(ISBLANK($H29),0,IF($H29<0,-$H29,IF($H29>9,$H29+2,11)))+IF(ISBLANK($I29),0,IF($I29<0,-$I29,IF($I29>9,$I29+2,11)))","v":0},{"$f":"IF(ISBLANK($E29),0,IF($E29>0,$E29,IF($E29<-9,-$E29+2,11)))+IF(ISBLANK($F29),0,IF($F29>0,$F29,IF($F29<-9,-$F29+2,11)))+IF(ISBLANK($G29),0,IF($G29>0,$G29,IF($G29<-9,-$G29+2,11)))+IF(ISBLANK($H29),0,IF($H29>0,$H29,IF($H29<-9,-$H29+2,11)))+IF(ISBLANK($I29),0,IF($I29>0,$I29,IF($I29<-9,-$I29+2,11)))","v":0},null,null,{"$f":"+AA29","v":0},{"$f":"+Z29","v":0}]
["1 contre 2",{"$f":"B20","v":"Zan"},{"$f":"B21","v":"Ariel"},null,4,5,3,null,null,{"$f":"IF(SUM($E30:$I30)=0,0,IF(COUNTIF($E30:$I30,\">0\")-COUNTIF($E30:$I30,\"<0\")>0,1,0))","v":1},{"$f":"IF(SUM($E30:$I30)=0,0,IF(COUNTIF($E30:$I30,\">0\")-COUNTIF($E30:$I30,\"<0\")<0,1,0))","v":0},null,null,null,{"$f":"COUNTIF($E30:$I30,\">0\")","v":3},{"$f":"COUNTIF($E30:$I30,\"<0\")","v":0},{"$f":"+P30","v":0},{"$f":"+O30","v":3},null,null,null,null,null,{"$f":"IF(ISBLANK($E30),0,IF($E30<0,-$E30,IF($E30>9,$E30+2,11)))+IF(ISBLANK($F30),0,IF($F30<0,-$F30,IF($F30>9,$F30+2,11)))+IF(ISBLANK($G30),0,IF($G30<0,-$G30,IF($G30>9,$G30+2,11)))+IF(ISBLANK($H30),0,IF($H30<0,-$H30,IF($H30>9,$H30+2,11)))+IF(ISBLANK($I30),0,IF($I30<0,-$I30,IF($I30>9,$I30+2,11)))","v":33},{"$f":"IF(ISBLANK($E30),0,IF($E30>0,$E30,IF($E30<-9,-$E30+2,11)))+IF(ISBLANK($F30),0,IF($F30>0,$F30,IF($F30<-9,-$F30+2,11)))+IF(ISBLANK($G30),0,IF($G30>0,$G30,IF($G30<-9,-$G30+2,11)))+IF(ISBLANK($H30),0,IF($H30>0,$H30,IF($H30<-9,-$H30+2,11)))+IF(ISBLANK($I30),0,IF($I30>0,$I30,IF($I30<-9,-$I30+2,11)))","v":12},{"$f":"+Y30","v":12},{"$f":"+X30","v":33}]
["3 contre 4",{"$f":"B22","v":"Stephane"},{"$f":"B23","v":0},null,null,null,null,null,null,null,null,{"$f":"IF(SUM($E31:$I31)=0,0,IF(COUNTIF($E31:$I31,\">0\")-COUNTIF($E31:$I31,\"<0\")>0,1,0))","v":0},{"$f":"IF(SUM($E31:$I31)=0,0,IF(COUNTIF($E31:$I31,\">0\")-COUNTIF($E31:$I31,\"<0\")<0,1,0))","v":0},null,null,null,null,null,{"$f":"COUNTIF($E31:$I31,\">0\")","v":0},{"$f":"COUNTIF($E31:$I31,\"<0\")","v":0},{"$f":"+T31","v":0},{"$f":"+S31","v":0},null,null,null,null,null,{"$f":"IF(ISBLANK($E31),0,IF($E31<0,-$E31,IF($E31>9,$E31+2,11)))+IF(ISBLANK($F31),0,IF($F31<0,-$F31,IF($F31>9,$F31+2,11)))+IF(ISBLANK($G31),0,IF($G31<0,-$G31,IF($G31>9,$G31+2,11)))+IF(ISBLANK($H31),0,IF($H31<0,-$H31,IF($H31>9,$H31+2,11)))+IF(ISBLANK($I31),0,IF($I31<0,-$I31,IF($I31>9,$I31+2,11)))","v":0},{"$f":"IF(ISBLANK($E31),0,IF($E31>0,$E31,IF($E31<-9,-$E31+2,11)))+IF(ISBLANK($F31),0,IF($F31>0,$F31,IF($F31<-9,-$F31+2,11)))+IF(ISBLANK($G31),0,IF($G31>0,$G31,IF($G31<-9,-$G31+2,11)))+IF(ISBLANK($H31),0,IF($H31>0,$H31,IF($H31<-9,-$H31+2,11)))+IF(ISBLANK($I31),0,IF($I31>0,$I31,IF($I31<-9,-$I31+2,11)))","v":0},{"$f":"+AC31","v":0},{"$f":"+AB31","v":0}]
[null,null,null,null,null,null,null,null,"Total",{"$f":"SUM(J26:J31)","v":2},{"$f":"SUM(K26:K31)","v":1},{"$f":"SUM(L26:L31)","v":0},{"$f":"SUM(M26:M31)","v":0},null,{"$f":"SUM(O26:O31)","v":6},1,3,5,3,6,0,0,null,{"$f":"SUM(X26:X31)","v":74},39,69,83,77,98,0,0]
[null,null,null,null,null,null,null,null,"Classement",1,2,3,4,null,{"$f":"IFERROR(O32/(O32+P32),0)","v":0.8571428571428571},null,{"$f":"IFERROR(Q32/(Q32+R32),0)","v":0.375},null,{"$f":"IFERROR(S32/(S32+T32),0)","v":0.33333333333333331},null,{"$f":"IFERROR(U32/(U32+V32),0)","v":0},null,null,{"$f":"IFERROR(X32/(X32+Y32),0)","v":0.65486725663716816},null,{"$f":"IFERROR(Z32/(Z32+AA32),0)","v":0.45394736842105265},null,{"$f":"IFERROR(AB32/(AB32+AC32),0)","v":0.44},null,{"$f":"IFERROR(AD32/(AD32+AE32),0)","v":0}]

{"sheet":"Poules C - D","index":2,"n_rows":33,"n_cols":31,"rows_kept":33,"cut":false,"hidden":false,"merged":[[20,1,20,2],[21,1,21,2],[24,4,24,8],[2,1,2,2],[3,1,3,2],[4,1,4,2],[5,1,5,2],[7,4,7,8],[22,1,22,2],[19,1,19,2],[0,8,2,11],[1,1,1,2],[18,1,18,2],[17,8,19,11],[6,20,6,21],[15,14,15,15],[15,16,15,17],[15,18,15,19],[15,20,15,21],[6,14,6,15],[6,16,6,17],[6,18,6,19],[23,14,23,15],[23,16,23,17],[23,18,23,19],[23,20,23,21],[32,14,32,15],[32,16,32,17],[32,18,32,19],[32,20,32,21],[6,23,6,24],[6,25,6,26],[6,27,6,28],[6,29,6,30],[15,23,15,24],[15,25,15,26],[15,27,15,28],[15,29,15,30],[23,23,23,24],[23,25,23,26],[23,27,23,28],[23,29,23,30],[32,23,32,24],[32,25,32,26],[32,27,32,28],[32,29,32,30]]}
["POULE","C"]
[null,"NOM Prénom",null,"Clt",null,null,null,"TABLE"]
[1,{"$f":"Tableau!F12","v":"Matthieu"},null,1]
[2,{"$f":"Tableau!F13","v":"KarineA"},null,2]
[3,{"$f":"Tableau!F14","v":"Romain"},null,3]
[4,{"$f":"Tableau!F15","v":0},null,4,null,null,null,null,null,null,null,null,null,"Sets",null,null,null,null,null,null,null,null,"Pts"]
[null,null,null,null,null,null,null,null,null,null,null,null,"1 pour victoire - 0 pour défaite",null,1,null,2,null,3,null,4,null,null,1,null,2,null,3,null,4]
[null,"Nom Prénom","Nom Prénom","Table","Scores",null,null,null,null,1,2,3,4,null,"G","P","G","P","G","P","G","P",null,"G","P","G","P","G","P","G","P"]
["1 contre 4",{"$f":"B3","v":"Matthieu"},{"$f":"B6","v":0},null,null,null,null,null,null,{"$f":"IF(SUM($E9:$I9)=0,0,IF(COUNTIF($E9:$I9,\">0\")-COUNTIF($E9:$I9,\"<0\")>0,1,0))","v":0},null,null,{"$f":"IF(SUM($E9:$I9)=0,0,IF(COUNTIF($E9:$I9,\">0\")-COUNTIF($E9:$I9,\"<0\")<0,1,0))","v":0},null,{"$f":"COUNTIF($E9:$I9,\">0\")","v":0},{"$f":"COUNTIF($E9:$I9,\"<0\")","v":0},null,null,null,null,{"$f":"P9","v":0},{"$f":"O9","v":0},null,{"$f":"IF(ISBLANK($E9),0,IF($E9<0,-$E9,IF($E9>9,$E9+2,11)))+IF(ISBLANK($F9),0,IF($F9<0,-$F9,IF($F9>9,$F9+2,11)))+IF(ISBLANK($G9),0,IF($G9<0,-$G9,IF($G9>9,$G9+2,11)))+IF(ISBLANK($H9),0,IF($H9<0,-$H9,IF($H9>9,$H9+2,11)))+IF(ISBLANK($I9),0,IF($I9<0,-$I9,IF($I9>9,$I9+2,11)))","v":0},{"$f":"IF(ISBLANK($E9),0,IF($E9>0,$E9,IF($E9<-9,-$E9+2,11)))+IF(ISBLANK($F9),0,IF($F9>0,$F9,IF($F9<-9,-$F9+2,11)))+IF(ISBLANK($G9),0,IF($G9>0,$G9,IF($G9<-9,-$G9+2,11)))+IF(ISBLANK($H9),0,IF($H9>0,$H9,IF($H9<-9,-$H9+2,11)))+IF(ISBLANK($I9),0,IF($I9>0,$I9,IF($I9<-9,-$I9+2,11)))","v":0},null,null,null,null,{"$f":"Y9","v":0},{"$f":"X9","v":0}]
["2 contre 3",{"$f":"B4","v":"KarineA"},{"$f":"B5","v":"Romain"},null,4,5,14,null,null,null,{"$f":"IF(SUM($E10:$I10)=0,0,IF(COUNTIF($E10:$I10,\">0\")-COUNTIF($E10:$I10,\"<0\")>0,1,0))","v":1},{"$f":"IF(SUM($E10:$I10)=0,0,IF(COUNTIF($E10:$I10,\">0\")-COUNTIF($E10:$I10,\"<0\")<0,1,0))","v":0},null,null,null,null,{"$f":"COUNTIF($E10:$I10,\">0\")","v":3},{"$f":"COUNTIF($E10:$I10,\"<0\")","v":0},{"$f":"+R10","v":0},{"$f":"+Q10","v":3},null,null,null,null,null,{"$f":"IF(ISBLANK($E10),0,IF($E10<0,-$E10,IF($E10>9,$E10+2,11)))+IF(ISBLANK($F10),0,IF($F10<0,-$F10,IF($F10>9,$F10+2,11)))+IF(ISBLANK($G10),0,IF($G10<0,-$G10,IF($G10>9,$G10+2,11)))+IF(ISBLANK($H10),0,IF($H10<0,-$H10,IF($H10>9,$H10+2,11)))+IF(ISBLANK($I10),0,IF($I10<0,-$I10,IF($I10>9,$I10+2,11)))","v":38},{"$f":"IF(ISBLANK($E10),0,IF($E10>0,$E10,IF($E10<-9,-$E10+2,11)))+IF(ISBLANK($F10),0,IF($F10>0,$F10,IF($F10<-9,-$F10+2,11)))+IF(ISBLANK($G10),0,IF($G10>0,$G10,IF($G10<-9,-$G10+2,11)))+IF(ISBLANK($H10),0,IF($H10>0,$H10,IF($H10<-9,-$H10+2,11)))+IF(ISBLANK($I10),0,IF($I10>0,$I10,IF($I10<-9,-$I10+2,11)))","v":23},{"$f":"+AA10","v":23},{"$f":"+Z10","v":38}]
["1 contre 3",{"$f":"B3","v":"Matthieu"},{"$f":"B5","v":"Romain"},null,8,4,6,null,null,{"$f":"IF(SUM($E11:$I11)=0,0,IF(COUNTIF($E11:$I11,\">0\")-COUNTIF($E11:$I11,\"<0\")>0,1,0))","v":1},null,{"$f":"IF(SUM($E11:$I11)=0,0,IF(COUNTIF($E11:$I11,\">0\")-COUNTIF($E11:$I11,\"<0\")<0,1,0))","v":0},null,null,{"$f":"COUNTIF($E11:$I11,\">0\")","v":3},{"$f":"COUNTIF($E11:$I11,\"<0\")","v":0},null,null,{"$f":"+P11","v":0},{"$f":"+O11","v":3},null,null,null,{"$f":"IF(ISBLANK($E11),0,IF($E11<0,-$E11,IF($E11>9,$E11+2,11)))+IF(ISBLANK($F11),0,IF($F11<0,-$F11,IF($F11>9,$F11+2,11)))+IF(ISBLANK($G11),0,IF($G11<0,-$G11,IF($G11>9,$G11+2,11)))+IF(ISBLANK($H11),0,IF($H11<0,-$H11,IF($H11>9,$H11+2,11)))+IF(ISBLANK($I11),0,IF($I11<0,-$I11,IF($I11>9,$I11+2,11)))","v":33},{"$f":"IF(ISBLANK($E11),0,IF($E11>0,$E11,IF($E11<-9,-$E11+2,11)))+IF(ISBLANK($F11),0,IF($F11>0,$F11,IF($F11<-9,-$F11+2,11)))+IF(ISBLANK($G11),0,IF($G11>0,$G11,IF($G11<-9,-$G11+2,11)))+IF(ISBLANK($H11),0,IF($H11>0,$H11,IF($H11<-9,-$H11+2,11)))+IF(ISBLANK($I11),0,IF($I11>0,$I11,IF($I11<-9,-$I11+2,11)))","v":18},null,null,{"$f":"+Y11","v":18},{"$f":"+X11","v":33}]
["2 contre 4",{"$f":"B4","v":"KarineA"},{"$f":"B6","v":0},null,null,null,null,null,null,null,{"$f":"IF(SUM($E12:$I12)=0,0,IF(COUNTIF($E12:$I12,\">0\")-COUNTIF($E12:$I12,\"<0\")>0,1,0))","v":0},null,{"$f":"IF(SUM($E12:$I12)=0,0,IF(COUNTIF($E12:$I12,\">0\")-COUNTIF($E12:$I12,\"<0\")<0,1,0))","v":0},null,null,null,{"$f":"COUNTIF($E12:$I12,\">0\")","v":0},{"$f":"COUNTIF($E12:$I12,\"<0\")","v":0},null,null,{"$f":"+R12","v":0},{"$f":"+Q12","v":0},null,null,null,{"$f":"IF(ISBLANK($E12),0,IF($E12<0,-$E12,IF($E12>9,$E12+2,11)))+IF(ISBLANK($F12),0,IF($F12<0,-$F12,IF($F12>9,$F12+2,11)))+IF(ISBLANK($G12),0,IF($G12<0,-$G12,IF($G12>9,$G12+2,11)))+IF(ISBLANK($H12),0,IF($H12<0,-$H12,IF($H12>9,$H12+2,11)))+IF(ISBLANK($I12),0,IF($I12<0,-$I12,IF($I12>9,$I12+2,11)))","v":0},{"$f":"IF(ISBLANK($E12),0,IF($E12>0,$E12,IF($E12<-9,-$E12+2,11)))+IF(ISBLANK($F12),0,IF($F12>0,$F12,IF($F12<-9,-$F12+2,11)))+IF(ISBLANK($G12),0,IF($G12>0,$G12,IF($G12<-9,-$G12+2,11)))+IF(ISBLANK($H12),0,IF($H12>0,$H12,IF($H12<-9,-$H12+2,11)))+IF(ISBLANK($I12),0,IF($I12>0,$I12,IF($I12<-9,-$I12+2,11)))","v":0},null,null,{"$f":"+AA12","v":0},{"$f":"+Z12","v":0}]
["1 contre 2",{"$f":"B3","v":"Matthieu"},{"$f":"B4","v":"KarineA"},null,6,8,5,null,null,{"$f":"IF(SUM($E13:$I13)=0,0,IF(COUNTIF($E13:$I13,\">0\")-COUNTIF($E13:$I13,\"<0\")>0,1,0))","v":1},{"$f":"IF(SUM($E13:$I13)=0,0,IF(COUNTIF($E13:$I13,\">0\")-COUNTIF($E13:$I13,\"<0\")<0,1,0))","v":0},null,null,null,{"$f":"COUNTIF($E13:$I13,\">0\")","v":3},{"$f":"COUNTIF($E13:$I13,\"<0\")","v":0},{"$f":"+P13","v":0},{"$f":"+O13","v":3},null,null,null,null,null,{"$f":"IF(ISBLANK($E13),0,IF($E13<0,-$E13,IF($E13>9,$E13+2,11)))+IF(ISBLANK($F13),0,IF($F13<0,-$F13,IF($F13>9,$F13+2,11)))+IF(ISBLANK($G13),0,IF($G13<0,-$G13,IF($G13>9,$G13+2,11)))+IF(ISBLANK($H13),0,IF($H13<0,-$H13,IF($H13>9,$H13+2,11)))+IF(ISBLANK($I13),0,IF($I13<0,-$I13,IF($I13>9,$I13+2,11)))","v":33},{"$f":"IF(ISBLANK($E13),0,IF($E13>0,$E13,IF($E13<-9,-$E13+2,11)))+IF(ISBLANK($F13),0,IF($F13>0,$F13,IF($F13<-9,-$F13+2,11)))+IF(ISBLANK($G13),0,IF($G13>0,$G13,IF($G13<-9,-$G13+2,11)))+IF(ISBLANK($H13),0,IF($H13>0,$H13,IF($H13<-9,-$H13+2,11)))+IF(ISBLANK($I13),0,IF($I13>0,$I13,IF($I13<-9,-$I13+2,11)))","v":19},{"$f":"+Y13","v":19},{"$f":"+X13","v":33}]
["3 contre 4",{"$f":"B5","v":"Romain"},{"$f":"B6","v":0},null,null,null,null,null,null,null,null,{"$f":"IF(SUM($E14:$I14)=0,0,IF(COUNTIF($E14:$I14,\">0\")-COUNTIF($E14:$I14,\"<0\")>0,1,0))","v":0},{"$f":"IF(SUM($E14:$I14)=0,0,IF(COUNTIF($E14:$I14,\">0\")-COUNTIF($E14:$I14,\"<0\")<0,1,0))","v":0},null,null,null,null,null,{"$f":"COUNTIF($E14:$I14,\">0\")","v":0},{"$f":"COUNTIF($E14:$I14,\"<0\")","v":0},{"$f":"+T14","v":0},{"$f":"+S14","v":0},null,null,null,null,null,{"$f":"IF(ISBLANK($E14),0,IF($E14<0,-$E14,IF($E14>9,$E14+2,11)))+IF(ISBLANK($F14),0,IF($F14<0,-$F14,IF($F14>9,$F14+2,11)))+IF(ISBLANK($G14),0,IF($G14<0,-$G14,IF($G14>9,$G14+2,11)))+IF(ISBLANK($H14),0,IF($H14<0,-$H14,IF($H14>9,$H14+2,11)))+IF(ISBLANK($I14),0,IF($I14<0,-$I14,IF($I14>9,$I14+2,11)))","v":0},{"$f":"IF(ISBLANK($E14),0,IF($E14>0,$E14,IF($E14<-9,-$E14+2,11)))+IF(ISBLANK($F14),0,IF($F14>0,$F14,IF($F14<-9,-$F14+2,11)))+IF(ISBLANK($G14),0,IF($G14>0,$G14,IF($G14<-9,-$G14+2,11)))+IF(ISBLANK($H14),0,IF($H14>0,$H14,IF($H14<-9,-$H14+2,11)))+IF(ISBLANK($I14),0,IF($I14>0,$I14,IF($I14<-9,-$I14+2,11)))","v":0},{"$f":"+AC14","v":0},{"$f":"+AB14","v":0}]
[null,null,null,null,null,null,null,null,"Total",{"$f":"SUM(J9:J14)","v":2},{"$f":"SUM(K9:K14)","v":1},{"$f":"SUM(L9:L14)","v":0},{"$f":"SUM(M9:M14)","v":0},null,{"$f":"SUM(O9:O14)","v":6},0,3,3,0,6,0,0,null,{"$f":"SUM(X9:X14)","v":66},37,57,56,41,71,0,0]
[null,null,null,null,null,null,null,null,"Classement",1,2,3,4,null,{"$f":"IFERROR(O15/(O15+P15),0)","v":1},null,{"$f":"IFERROR(Q15/(Q15+R15),0)","v":0.5},null,{"$f":"IFERROR(S15/(S15+T15),0)","v":0},null,{"$f":"IFERROR(U15/(U15+V15),0)","v":0},null,null,{"$f":"IFERROR(X15/(X15+Y15),0)","v":0.64077669902912626},null,{"$f":"IFERROR(Z15/(Z15+AA15),0)","v":0.50442477876106195},null,{"$f":"IFERROR(AB15/(AB15+AC15),0)","v":0.36607142857142855},null,{"$f":"IFERROR(AD15/(AD15+AE15),0)","v":0}]
[]
["POULE","D"]
[null,"NOM Prénom",null,"Clt",null,null,null,"TABLE"]
[1,{"$f":"Tableau!F17","v":"Sebden"},null,1]
[2,{"$f":"Tableau!F18","v":"Eric"},null,2]
[3,{"$f":"Tableau!F19","v":"Monique"},null,3]
[4,{"$f":"Tableau!F20","v":0},null,4,null,null,null,null,null,null,null,null,null,"Sets",null,null,null,null,null,null,null,null,"Pts"]
[null,null,null,null,null,null,null,null,null,null,null,null,"1 pour victoire - 0 pour défaite",null,1,null,2,null,3,null,4,null,null,1,null,2,null,3,null,4]
[null,"Nom Prénom","Nom Prénom","Table","Scores",null,null,null,null,1,2,3,4,null,"G","P","G","P","G","P","G","P",null,"G","P","G","P","G","P","G","P"]
["1 contre 4",{"$f":"B20","v":"Sebden"},{"$f":"B23","v":0},null,null,null,null,null,null,{"$f":"IF(SUM($E26:$I26)=0,0,IF(COUNTIF($E26:$I26,\">0\")-COUNTIF($E26:$I26,\"<0\")>0,1,0))","v":0},null,null,{"$f":"IF(SUM($E26:$I26)=0,0,IF(COUNTIF($E26:$I26,\">0\")-COUNTIF($E26:$I26,\"<0\")<0,1,0))","v":0},null,{"$f":"COUNTIF($E26:$I26,\">0\")","v":0},{"$f":"COUNTIF($E26:$I26,\"<0\")","v":0},null,null,null,null,{"$f":"P26","v":0},{"$f":"O26","v":0},null,{"$f":"IF(ISBLANK($E26),0,IF($E26<0,-$E26,IF($E26>9,$E26+2,11)))+IF(ISBLANK($F26),0,IF($F26<0,-$F26,IF($F26>9,$F26+2,11)))+IF(ISBLANK($G26),0,IF($G26<0,-$G26,IF($G26>9,$G26+2,11)))+IF(ISBLANK($H26),0,IF($H26<0,-$H26,IF($H26>9,$H26+2,11)))+IF(ISBLANK($I26),0,IF($I26<0,-$I26,IF($I26>9,$I26+2,11)))","v":0},{"$f":"IF(ISBLANK($E26),0,IF($E26>0,$E26,IF($E26<-9,-$E26+2,11)))+IF(ISBLANK($F26),0,IF($F26>0,$F26,IF($F26<-9,-$F26+2,11)))+IF(ISBLANK($G26),0,IF($G26>0,$G26,IF($G26<-9,-$G26+2,11)))+IF(ISBLANK($H26),0,IF($H26>0,$H26,IF($H26<-9,-$H26+2,11)))+IF(ISBLANK($I26),0,IF($I26>0,$I26,IF($I26<-9,-$I26+2,11)))","v":0},null,null,null,null,{"$f":"Y26","v":0},{"$f":"X26","v":0}]
["2 contre 3",{"$f":"B21","v":"Eric"},{"$f":"B22","v":"Monique"},4,9,-9,-7,9,-10,null,{"$f":"IF(SUM($E27:$I27)=0,0,IF(COUNTIF($E27:$I27,\">0\")-COUNTIF($E27:$I27,\"<0\")>0,1,0))","v":0},{"$f":"IF(SUM($E27:$I27)=0,0,IF(COUNTIF($E27:$I27,\">0\")-COUNTIF($E27:$I27,\"<0\")<0,1,0))","v":1},null,null,null,null,{"$f":"COUNTIF($E27:$I27,\">0\")","v":2},{"$f":"COUNTIF($E27:$I27,\"<0\")","v":3},{"$f":"+R27","v":3},{"$f":"+Q27","v":2},null,null,null,null,null,{"$f":"IF(ISBLANK($E27),0,IF($E27<0,-$E27,IF($E27>9,$E27+2,11)))+IF(ISBLANK($F27),0,IF($F27<0,-$F27,IF($F27>9,$F27+2,11)))+IF(ISBLANK($G27),0,IF($G27<0,-$G27,IF($G27>9,$G27+2,11)))+IF(ISBLANK($H27),0,IF($H27<0,-$H27,IF($H27>9,$H27+2,11)))+IF(ISBLANK($I27),0,IF($I27<0,-$I27,IF($I27>9,$I27+2,11)))","v":48},{"$f":"IF(ISBLANK($E27),0,IF($E27>0,$E27,IF($E27<-9,-$E27+2,11)))+IF(ISBLANK($F27),0,IF($F27>0,$F27,IF($F27<-9,-$F27+2,11)))+IF(ISBLANK($G27),0,IF($G27>0,$G27,IF($G27<-9,-$G27+2,11)))+IF(ISBLANK($H27),0,IF($H27>0,$H27,IF($H27<-9,-$H27+2,11)))+IF(ISBLANK($I27),0,IF($I27>0,$I27,IF($I27<-9,-$I27+2,11)))","v":52},{"$f":"+AA27","v":52},{"$f":"+Z27","v":48}]
["1 contre 3",{"$f":"B20","v":"Sebden"},{"$f":"B22","v":"Monique"},4,1,5,2,null,null,{"$f":"IF(SUM($E28:$I28)=0,0,IF(COUNTIF($E28:$I28,\">0\")-COUNTIF($E28:$I28,\"<0\")>0,1,0))","v":1},null,{"$f":"IF(SUM($E28:$I28)=0,0,IF(COUNTIF($E28:$I28,\">0\")-COUNTIF($E28:$I28,\"<0\")<0,1,0))","v":0},null,null,{"$f":"COUNTIF($E28:$I28,\">0\")","v":3},{"$f":"COUNTIF($E28:$I28,\"<0\")","v":0},null,null,{"$f":"+P28","v":0},{"$f":"+O28","v":3},null,null,null,{"$f":"IF(ISBLANK($E28),0,IF($E28<0,-$E28,IF($E28>9,$E28+2,11)))+IF(ISBLANK($F28),0,IF($F28<0,-$F28,IF($F28>9,$F28+2,11)))+IF(ISBLANK($G28),0,IF($G28<0,-$G28,IF($G28>9,$G28+2,11)))+IF(ISBLANK($H28),0,IF($H28<0,-$H28,IF($H28>9,$H28+2,11)))+IF(ISBLANK($I28),0,IF($I28<0,-$I28,IF($I28>9,$I28+2,11)))","v":33},{"$f":"IF(ISBLANK($E28),0,IF($E28>0,$E28,IF($E28<-9,-$E28+2,11)))+IF(ISBLANK($F28),0,IF($F28>0,$F28,IF($F28<-9,-$F28+2,11)))+IF(ISBLANK($G28),0,IF($G28>0,$G28,IF($G28<-9,-$G28+2,11)))+IF(ISBLANK($H28),0,IF($H28>0,$H28,IF($H28<-9,-$H28+2,11)))+IF(ISBLANK($I28),0,IF($I28>0,$I28,IF($I28<-9,-$I28+2,11)))","v":8},null,null,{"$f":"+Y28","v":8},{"$f":"+X28","v":33}]
["2 contre 4",{"$f":"B21","v":"Eric"},{"$f":"B23","v":0},null,null,null,null,null,null,null,{"$f":"IF(SUM($E29:$I29)=0,0,IF(COUNTIF($E29:$I29,\">0\")-COUNTIF($E29:$I29,\"<0\")>0,1,0))","v":0},null,{"$f":"IF(SUM($E29:$I29)=0,0,IF(COUNTIF($E29:$I29,\">0\")-COUNTIF($E29:$I29,\"<0\")<0,1,0))","v":0},null,null,null,{"$f":"COUNTIF($E29:$I29,\">0\")","v":0},{"$f":"COUNTIF($E29:$I29,\"<0\")","v":0},null,null,{"$f":"+R29","v":0},{"$f":"+Q29","v":0},null,null,null,{"$f":"IF(ISBLANK($E29),0,IF($E29<0,-$E29,IF($E29>9,$E29+2,11)))+IF(ISBLANK($F29),0,IF($F29<0,-$F29,IF($F29>9,$F29+2,11)))+IF(ISBLANK($G29),0,IF($G29<0,-$G29,IF($G29>9,$G29+2,11)))+IF(ISBLANK($H29),0,IF($H29<0,-$H29,IF($H29>9,$H29+2,11)))+IF(ISBLANK($I29),0,IF($I29<0,-$I29,IF($I29>9,$I29+2,11)))","v":0},{"$f":"IF(ISBLANK($E29),0,IF($E29>0,$E29,IF($E29<-9,-$E29+2,11)))+IF(ISBLANK($F29),0,IF($F29>0,$F29,IF($F29<-9,-$F29+2,11)))+IF(ISBLANK($G29),0,IF($G29>0,$G29,IF($G29<-9,-$G29+2,11)))+IF(ISBLANK($H29),0,IF($H29>0,$H29,IF($H29<-9,-$H29+2,11)))+IF(ISBLANK($I29),0,IF($I29>0,$I29,IF($I29<-9,-$I29+2,11)))","v":0},null,null,{"$f":"+AA29","v":0},{"$f":"+Z29","v":0}]
["1 contre 2",{"$f":"B20","v":"Sebden"},{"$f":"B21","v":"Eric"},4,7,6,5,null,null,{"$f":"IF(SUM($E30:$I30)=0,0,IF(COUNTIF($E30:$I30,\">0\")-COUNTIF($E30:$I30,\"<0\")>0,1,0))","v":1},{"$f":"IF(SUM($E30:$I30)=0,0,IF(COUNTIF($E30:$I30,\">0\")-COUNTIF($E30:$I30,\"<0\")<0,1,0))","v":0},null,null,null,{"$f":"COUNTIF($E30:$I30,\">0\")","v":3},{"$f":"COUNTIF($E30:$I30,\"<0\")","v":0},{"$f":"+P30","v":0},{"$f":"+O30","v":3},null,null,null,null,null,{"$f":"IF(ISBLANK($E30),0,IF($E30<0,-$E30,IF($E30>9,$E30+2,11)))+IF(ISBLANK($F30),0,IF($F30<0,-$F30,IF($F30>9,$F30+2,11)))+IF(ISBLANK($G30),0,IF($G30<0,-$G30,IF($G30>9,$G30+2,11)))+IF(ISBLANK($H30),0,IF($H30<0,-$H30,IF($H30>9,$H30+2,11)))+IF(ISBLANK($I30),0,IF($I30<0,-$I30,IF($I30>9,$I30+2,11)))","v":33},{"$f":"IF(ISBLANK($E30),0,IF($E30>0,$E30,IF($E30<-9,-$E30+2,11)))+IF(ISBLANK($F30),0,IF($F30>0,$F30,IF($F30<-9,-$F30+2,11)))+IF(ISBLANK($G30),0,IF($G30>0,$G30,IF($G30<-9,-$G30+2,11)))+IF(ISBLANK($H30),0,IF($H30>0,$H30,IF($H30<-9,-$H30+2,11)))+IF(ISBLANK($I30),0,IF($I30>0,$I30,IF($I30<-9,-$I30+2,11)))","v":18},{"$f":"+Y30","v":18},{"$f":"+X30","v":33}]
["3 contre 4",{"$f":"B22","v":"Monique"},{"$f":"B23","v":0},null,null,null,null,null,null,null,null,{"$f":"IF(SUM($E31:$I31)=0,0,IF(COUNTIF($E31:$I31,\">0\")-COUNTIF($E31:$I31,\"<0\")>0,1,0))","v":0},{"$f":"IF(SUM($E31:$I31)=0,0,IF(COUNTIF($E31:$I31,\">0\")-COUNTIF($E31:$I31,\"<0\")<0,1,0))","v":0},null,null,null,null,null,{"$f":"COUNTIF($E31:$I31,\">0\")","v":0},{"$f":"COUNTIF($E31:$I31,\"<0\")","v":0},{"$f":"+T31","v":0},{"$f":"+S31","v":0},null,null,null,null,null,{"$f":"IF(ISBLANK($E31),0,IF($E31<0,-$E31,IF($E31>9,$E31+2,11)))+IF(ISBLANK($F31),0,IF($F31<0,-$F31,IF($F31>9,$F31+2,11)))+IF(ISBLANK($G31),0,IF($G31<0,-$G31,IF($G31>9,$G31+2,11)))+IF(ISBLANK($H31),0,IF($H31<0,-$H31,IF($H31>9,$H31+2,11)))+IF(ISBLANK($I31),0,IF($I31<0,-$I31,IF($I31>9,$I31+2,11)))","v":0},{"$f":"IF(ISBLANK($E31),0,IF($E31>0,$E31,IF($E31<-9,-$E31+2,11)))+IF(ISBLANK($F31),0,IF($F31>0,$F31,IF($F31<-9,-$F31+2,11)))+IF(ISBLANK($G31),0,IF($G31>0,$G31,IF($G31<-9,-$G31+2,11)))+IF(ISBLANK($H31),0,IF($H31>0,$H31,IF($H31<-9,-$H31+2,11)))+IF(ISBLANK($I31),0,IF($I31>0,$I31,IF($I31<-9,-$I31+2,11)))","v":0},{"$f":"+AC31","v":0},{"$f":"+AB31","v":0}]
[null,null,null,null,null,null,null,null,"Total",{"$f":"SUM(J26:J31)","v":2},{"$f":"SUM(K26:K31)","v":0},{"$f":"SUM(L26:L31)","v":1},{"$f":"SUM(M26:M31)","v":0},null,{"$f":"SUM(O26:O31)","v":6},0,2,6,3,5,0,0,null,{"$f":"SUM(X26:X31)","v":66},26,66,85,60,81,0,0]
[null,null,null,null,null,null,null,null,"Classement",1,3,2,4,null,{"$f":"IFERROR(O32/(O32+P32),0)","v":1},null,{"$f":"IFERROR(Q32/(Q32+R32),0)","v":0.25},null,{"$f":"IFERROR(S32/(S32+T32),0)","v":0.375},null,{"$f":"IFERROR(U32/(U32+V32),0)","v":0},null,null,{"$f":"IFERROR(X32/(X32+Y32),0)","v":0.71739130434782605},null,{"$f":"IFERROR(Z32/(Z32+AA32),0)","v":0.4370860927152318},null,{"$f":"IFERROR(AB32/(AB32+AC32),0)","v":0.42553191489361702},null,{"$f":"IFERROR(AD32/(AD32+AE32),0)","v":0}]

{"sheet":"Poules E - F","index":3,"n_rows":33,"n_cols":31,"rows_kept":33,"cut":false,"hidden":false,"merged":[[18,1,18,2],[0,8,2,11],[17,8,19,11],[22,1,22,2],[24,4,24,8],[7,4,7,8],[19,1,19,2],[20,1,20,2],[21,1,21,2],[2,1,2,2],[3,1,3,2],[4,1,4,2],[5,1,5,2],[1,1,1,2],[6,14,6,15],[6,16,6,17],[6,18,6,19],[6,20,6,21],[15,14,15,15],[15,16,15,17],[15,18,15,19],[15,20,15,21],[23,14,23,15],[23,16,23,17],[23,18,23,19],[23,20,23,21],[32,14,32,15],[32,16,32,17],[32,18,32,19],[32,20,32,21],[6,23,6,24],[6,25,6,26],[6,27,6,28],[6,29,6,30],[15,23,15,24],[15,25,15,26],[15,27,15,28],[15,29,15,30],[23,23,23,24],[23,25,23,26],[23,27,23,28],[23,29,23,30],[32,23,32,24],[32,25,32,26],[32,27,32,28],[32,29,32,30]]}
["POULE","E"]
[null,"NOM Prénom",null,"Clt",null,"TABLE"]
[1,{"$f":"Tableau!F22","v":"Tom"},null,1]
[2,{"$f":"Tableau!F23","v":"Val"},null,2]
[3,{"$f":"Tableau!F24","v":"Axel"},null,3]
[4,{"$f":"Tableau!F25","v":"KarineLL"},null,4,null,null,null,null,null,null,null,null,null,"Sets",null,null,null,null,null,null,null,null,"Pts"]
[null,null,null,null,null,null,null,null,null,null,null,null,"1 pour victoire - 0 pour défaite",null,1,null,2,null,3,null,4,null,null,1,null,2,null,3,null,4]
[null,"Nom Prénom","Nom Prénom","Table","Scores",null,null,null,null,1,2,3,4,null,"G","P","G","P","G","P","G","P",null,"G","P","G","P","G","P","G","P"]
["1 contre 4",{"$f":"B3","v":"Tom"},{"$f":"B6","v":"KarineLL"},5,3,5,4,null,null,{"$f":"IF(SUM($E9:$I9)=0,0,IF(COUNTIF($E9:$I9,\">0\")-COUNTIF($E9:$I9,\"<0\")>0,1,0))","v":1},null,null,{"$f":"IF(SUM($E9:$I9)=0,0,IF(COUNTIF($E9:$I9,\">0\")-COUNTIF($E9:$I9,\"<0\")<0,1,0))","v":0},null,{"$f":"COUNTIF($E9:$I9,\">0\")","v":3},{"$f":"COUNTIF($E9:$I9,\"<0\")","v":0},null,null,null,null,{"$f":"P9","v":0},{"$f":"O9","v":3},null,{"$f":"IF(ISBLANK($E9),0,IF($E9<0,-$E9,IF($E9>9,$E9+2,11)))+IF(ISBLANK($F9),0,IF($F9<0,-$F9,IF($F9>9,$F9+2,11)))+IF(ISBLANK($G9),0,IF($G9<0,-$G9,IF($G9>9,$G9+2,11)))+IF(ISBLANK($H9),0,IF($H9<0,-$H9,IF($H9>9,$H9+2,11)))+IF(ISBLANK($I9),0,IF($I9<0,-$I9,IF($I9>9,$I9+2,11)))","v":33},{"$f":"IF(ISBLANK($E9),0,IF($E9>0,$E9,IF($E9<-9,-$E9+2,11)))+IF(ISBLANK($F9),0,IF($F9>0,$F9,IF($F9<-9,-$F9+2,11)))+IF(ISBLANK($G9),0,IF($G9>0,$G9,IF($G9<-9,-$G9+2,11)))+IF(ISBLANK($H9),0,IF($H9>0,$H9,IF($H9<-9,-$H9+2,11)))+IF(ISBLANK($I9),0,IF($I9>0,$I9,IF($I9<-9,-$I9+2,11)))","v":12},null,null,null,null,{"$f":"Y9","v":12},{"$f":"X9","v":33}]
["2 contre 3",{"$f":"B4","v":"Val"},{"$f":"B5","v":"Axel"},5,7,2,5,null,null,null,{"$f":"IF(SUM($E10:$I10)=0,0,IF(COUNTIF($E10:$I10,\">0\")-COUNTIF($E10:$I10,\"<0\")>0,1,0))","v":1},{"$f":"IF(SUM($E10:$I10)=0,0,IF(COUNTIF($E10:$I10,\">0\")-COUNTIF($E10:$I10,\"<0\")<0,1,0))","v":0},null,null,null,null,{"$f":"COUNTIF($E10:$I10,\">0\")","v":3},{"$f":"COUNTIF($E10:$I10,\"<0\")","v":0},{"$f":"+R10","v":0},{"$f":"+Q10","v":3},null,null,null,null,null,{"$f":"IF(ISBLANK($E10),0,IF($E10<0,-$E10,IF($E10>9,$E10+2,11)))+IF(ISBLANK($F10),0,IF($F10<0,-$F10,IF($F10>9,$F10+2,11)))+IF(ISBLANK($G10),0,IF($G10<0,-$G10,IF($G10>9,$G10+2,11)))+IF(ISBLANK($H10),0,IF($H10<0,-$H10,IF($H10>9,$H10+2,11)))+IF(ISBLANK($I10),0,IF($I10<0,-$I10,IF($I10>9,$I10+2,11)))","v":33},{"$f":"IF(ISBLANK($E10),0,IF($E10>0,$E10,IF($E10<-9,-$E10+2,11)))+IF(ISBLANK($F10),0,IF($F10>0,$F10,IF($F10<-9,-$F10+2,11)))+IF(ISBLANK($G10),0,IF($G10>0,$G10,IF($G10<-9,-$G10+2,11)))+IF(ISBLANK($H10),0,IF($H10>0,$H10,IF($H10<-9,-$H10+2,11)))+IF(ISBLANK($I10),0,IF($I10>0,$I10,IF($I10<-9,-$I10+2,11)))","v":14},{"$f":"+AA10","v":14},{"$f":"+Z10","v":33}]
["1 contre 3",{"$f":"B3","v":"Tom"},{"$f":"B5","v":"Axel"},5,7,5,4,null,null,{"$f":"IF(SUM($E11:$I11)=0,0,IF(COUNTIF($E11:$I11,\">0\")-COUNTIF($E11:$I11,\"<0\")>0,1,0))","v":1},null,{"$f":"IF(SUM($E11:$I11)=0,0,IF(COUNTIF($E11:$I11,\">0\")-COUNTIF($E11:$I11,\"<0\")<0,1,0))","v":0},null,null,{"$f":"COUNTIF($E11:$I11,\">0\")","v":3},{"$f":"COUNTIF($E11:$I11,\"<0\")","v":0},null,null,{"$f":"+P11","v":0},{"$f":"+O11","v":3},null,null,null,{"$f":"IF(ISBLANK($E11),0,IF($E11<0,-$E11,IF($E11>9,$E11+2,11)))+IF(ISBLANK($F11),0,IF($F11<0,-$F11,IF($F11>9,$F11+2,11)))+IF(ISBLANK($G11),0,IF($G11<0,-$G11,IF($G11>9,$G11+2,11)))+IF(ISBLANK($H11),0,IF($H11<0,-$H11,IF($H11>9,$H11+2,11)))+IF(ISBLANK($I11),0,IF($I11<0,-$I11,IF($I11>9,$I11+2,11)))","v":33},{"$f":"IF(ISBLANK($E11),0,IF($E11>0,$E11,IF($E11<-9,-$E11+2,11)))+IF(ISBLANK($F11),0,IF($F11>0,$F11,IF($F11<-9,-$F11+2,11)))+IF(ISBLANK($G11),0,IF($G11>0,$G11,IF($G11<-9,-$G11+2,11)))+IF(ISBLANK($H11),0,IF($H11>0,$H11,IF($H11<-9,-$H11+2,11)))+IF(ISBLANK($I11),0,IF($I11>0,$I11,IF($I11<-9,-$I11+2,11)))","v":16},null,null,{"$f":"+Y11","v":16},{"$f":"+X11","v":33}]
["2 contre 4",{"$f":"B4","v":"Val"},{"$f":"B6","v":"KarineLL"},5,7,3,5,null,null,null,{"$f":"IF(SUM($E12:$I12)=0,0,IF(COUNTIF($E12:$I12,\">0\")-COUNTIF($E12:$I12,\"<0\")>0,1,0))","v":1},null,{"$f":"IF(SUM($E12:$I12)=0,0,IF(COUNTIF($E12:$I12,\">0\")-COUNTIF($E12:$I12,\"<0\")<0,1,0))","v":0},null,null,null,{"$f":"COUNTIF($E12:$I12,\">0\")","v":3},{"$f":"COUNTIF($E12:$I12,\"<0\")","v":0},null,null,{"$f":"+R12","v":0},{"$f":"+Q12","v":3},null,null,null,{"$f":"IF(ISBLANK($E12),0,IF($E12<0,-$E12,IF($E12>9,$E12+2,11)))+IF(ISBLANK($F12),0,IF($F12<0,-$F12,IF($F12>9,$F12+2,11)))+IF(ISBLANK($G12),0,IF($G12<0,-$G12,IF($G12>9,$G12+2,11)))+IF(ISBLANK($H12),0,IF($H12<0,-$H12,IF($H12>9,$H12+2,11)))+IF(ISBLANK($I12),0,IF($I12<0,-$I12,IF($I12>9,$I12+2,11)))","v":33},{"$f":"IF(ISBLANK($E12),0,IF($E12>0,$E12,IF($E12<-9,-$E12+2,11)))+IF(ISBLANK($F12),0,IF($F12>0,$F12,IF($F12<-9,-$F12+2,11)))+IF(ISBLANK($G12),0,IF($G12>0,$G12,IF($G12<-9,-$G12+2,11)))+IF(ISBLANK($H12),0,IF($H12>0,$H12,IF($H12<-9,-$H12+2,11)))+IF(ISBLANK($I12),0,IF($I12>0,$I12,IF($I12<-9,-$I12+2,11)))","v":15},null,null,{"$f":"+AA12","v":15},{"$f":"+Z12","v":33}]
["1 contre 2",{"$f":"B3","v":"Tom"},{"$f":"B4","v":"Val"},null,8,8,9,null,null,{"$f":"IF(SUM($E13:$I13)=0,0,IF(COUNTIF($E13:$I13,\">0\")-COUNTIF($E13:$I13,\"<0\")>0,1,0))","v":1},{"$f":"IF(SUM($E13:$I13)=0,0,IF(COUNTIF($E13:$I13,\">0\")-COUNTIF($E13:$I13,\"<0\")<0,1,0))","v":0},null,null,null,{"$f":"COUNTIF($E13:$I13,\">0\")","v":3},{"$f":"COUNTIF($E13:$I13,\"<0\")","v":0},{"$f":"+P13","v":0},{"$f":"+O13","v":3},null,null,null,null,null,{"$f":"IF(ISBLANK($E13),0,IF($E13<0,-$E13,IF($E13>9,$E13+2,11)))+IF(ISBLANK($F13),0,IF($F13<0,-$F13,IF($F13>9,$F13+2,11)))+IF(ISBLANK($G13),0,IF($G13<0,-$G13,IF($G13>9,$G13+2,11)))+IF(ISBLANK($H13),0,IF($H13<0,-$H13,IF($H13>9,$H13+2,11)))+IF(ISBLANK($I13),0,IF($I13<0,-$I13,IF($I13>9,$I13+2,11)))","v":33},{"$f":"IF(ISBLANK($E13),0,IF($E13>0,$E13,IF($E13<-9,-$E13+2,11)))+IF(ISBLANK($F13),0,IF($F13>0,$F13,IF($F13<-9,-$F13+2,11)))+IF(ISBLANK($G13),0,IF($G13>0,$G13,IF($G13<-9,-$G13+2,11)))+IF(ISBLANK($H13),0,IF($H13>0,$H13,IF($H13<-9,-$H13+2,11)))+IF(ISBLANK($I13),0,IF($I13>0,$I13,IF($I13<-9,-$I13+2,11)))","v":25},{"$f":"+Y13","v":25},{"$f":"+X13","v":33}]
["3 contre 4",{"$f":"B5","v":"Axel"},{"$f":"B6","v":"KarineLL"},null,null,null,null,null,null,null,null,{"$f":"IF(SUM($E14:$I14)=0,0,IF(COUNTIF($E14:$I14,\">0\")-COUNTIF($E14:$I14,\"<0\")>0,1,0))","v":0},{"$f":"IF(SUM($E14:$I14)=0,0,IF(COUNTIF($E14:$I14,\">0\")-COUNTIF($E14:$I14,\"<0\")<0,1,0))","v":0},null,null,null,null,null,{"$f":"COUNTIF($E14:$I14,\">0\")","v":0},{"$f":"COUNTIF($E14:$I14,\"<0\")","v":0},{"$f":"+T14","v":0},{"$f":"+S14","v":0},null,null,null,null,null,{"$f":"IF(ISBLANK($E14),0,IF($E14<0,-$E14,IF($E14>9,$E14+2,11)))+IF(ISBLANK($F14),0,IF($F14<0,-$F14,IF($F14>9,$F14+2,11)))+IF(ISBLANK($G14),0,IF($G14<0,-$G14,IF($G14>9,$G14+2,11)))+IF(ISBLANK($H14),0,IF($H14<0,-$H14,IF($H14>9,$H14+2,11)))+IF(ISBLANK($I14),0,IF($I14<0,-$I14,IF($I14>9,$I14+2,11)))","v":0},{"$f":"IF(ISBLANK($E14),0,IF($E14>0,$E14,IF($E14<-9,-$E14+2,11)))+IF(ISBLANK($F14),0,IF($F14>0,$F14,IF($F14<-9,-$F14+2,11)))+IF(ISBLANK($G14),0,IF($G14>0,$G14,IF($G14<-9,-$G14+2,11)))+IF(ISBLANK($H14),0,IF($H14>0,$H14,IF($H14<-9,-$H14+2,11)))+IF(ISBLANK($I14),0,IF($I14>0,$I14,IF($I14<-9,-$I14+2,11)))","v":0},{"$f":"+AC14","v":0},{"$f":"+AB14","v":0}]
[null,null,null,null,null,null,null,null,"Total",{"$f":"SUM(J9:J14)","v":3},{"$f":"SUM(K9:K14)","v":2},{"$f":"SUM(L9:L14)","v":0},{"$f":"SUM(M9:M14)","v":0},null,{"$f":"SUM(O9:O14)","v":9},0,6,3,0,6,0,6,null,{"$f":"SUM(X9:X14)","v":99},53,91,62,30,66,27,66]
[null,null,null,null,null,null,null,null,"Classement",1,2,3,4,null,{"$f":"IFERROR(O15/(O15+P15),0)","v":1},null,{"$f":"IFERROR(Q15/(Q15+R15),0)","v":0.66666666666666663},null,{"$f":"IFERROR(S15/(S15+T15),0)","v":0},null,{"$f":"IFERROR(U15/(U15+V15),0)","v":0},null,null,{"$f":"IFERROR(X15/(X15+Y15),0)","v":0.65131578947368418},null,{"$f":"IFERROR(Z15/(Z15+AA15),0)","v":0.59477124183006536},null,{"$f":"IFERROR(AB15/(AB15+AC15),0)","v":0.3125},null,{"$f":"IFERROR(AD15/(AD15+AE15),0)","v":0.29032258064516131}]
[]
["POULE","F"]
[null,"NOM Prénom",null,"Clt",null,"TABLE"]
[1,{"$f":"Tableau!F27","v":"Flo"},null,1]
[2,{"$f":"Tableau!F28","v":"Maxime"},null,2]
[3,{"$f":"Tableau!F29","v":"Benjamin"},null,3]
[4,{"$f":"Tableau!F30","v":"Jules"},null,4,null,null,null,null,null,null,null,null,null,"Sets",null,null,null,null,null,null,null,null,"Pts"]
[null,null,null,null,null,null,null,null,null,null,null,null,"1 pour victoire - 0 pour défaite",null,1,null,2,null,3,null,4,null,null,1,null,2,null,3,null,4]
[null,"Nom Prénom","Nom Prénom","Table","Scores",null,null,null,null,1,2,3,4,null,"G","P","G","P","G","P","G","P",null,"G","P","G","P","G","P","G","P"]
["1 contre 4",{"$f":"B20","v":"Flo"},{"$f":"B23","v":"Jules"},6,8,7,3,null,null,{"$f":"IF(SUM($E26:$I26)=0,0,IF(COUNTIF($E26:$I26,\">0\")-COUNTIF($E26:$I26,\"<0\")>0,1,0))","v":1},null,null,{"$f":"IF(SUM($E26:$I26)=0,0,IF(COUNTIF($E26:$I26,\">0\")-COUNTIF($E26:$I26,\"<0\")<0,1,0))","v":0},null,{"$f":"COUNTIF($E26:$I26,\">0\")","v":3},{"$f":"COUNTIF($E26:$I26,\"<0\")","v":0},null,null,null,null,{"$f":"P26","v":0},{"$f":"O26","v":3},null,{"$f":"IF(ISBLANK($E26),0,IF($E26<0,-$E26,IF($E26>9,$E26+2,11)))+IF(ISBLANK($F26),0,IF($F26<0,-$F26,IF($F26>9,$F26+2,11)))+IF(ISBLANK($G26),0,IF($G26<0,-$G26,IF($G26>9,$G26+2,11)))+IF(ISBLANK($H26),0,IF($H26<0,-$H26,IF($H26>9,$H26+2,11)))+IF(ISBLANK($I26),0,IF($I26<0,-$I26,IF($I26>9,$I26+2,11)))","v":33},{"$f":"IF(ISBLANK($E26),0,IF($E26>0,$E26,IF($E26<-9,-$E26+2,11)))+IF(ISBLANK($F26),0,IF($F26>0,$F26,IF($F26<-9,-$F26+2,11)))+IF(ISBLANK($G26),0,IF($G26>0,$G26,IF($G26<-9,-$G26+2,11)))+IF(ISBLANK($H26),0,IF($H26>0,$H26,IF($H26<-9,-$H26+2,11)))+IF(ISBLANK($I26),0,IF($I26>0,$I26,IF($I26<-9,-$I26+2,11)))","v":18},null,null,null,null,{"$f":"Y26","v":18},{"$f":"X26","v":33}]
["2 contre 3",{"$f":"B21","v":"Maxime"},{"$f":"B22","v":"Benjamin"},6,11,5,8,null,null,null,{"$f":"IF(SUM($E27:$I27)=0,0,IF(COUNTIF($E27:$I27,\">0\")-COUNTIF($E27:$I27,\"<0\")>0,1,0))","v":1},{"$f":"IF(SUM($E27:$I27)=0,0,IF(COUNTIF($E27:$I27,\">0\")-COUNTIF($E27:$I27,\"<0\")<0,1,0))","v":0},null,null,null,null,{"$f":"COUNTIF($E27:$I27,\">0\")","v":3},{"$f":"COUNTIF($E27:$I27,\"<0\")","v":0},{"$f":"+R27","v":0},{"$f":"+Q27","v":3},null,null,null,null,null,{"$f":"IF(ISBLANK($E27),0,IF($E27<0,-$E27,IF($E27>9,$E27+2,11)))+IF(ISBLANK($F27),0,IF($F27<0,-$F27,IF($F27>9,$F27+2,11)))+IF(ISBLANK($G27),0,IF($G27<0,-$G27,IF($G27>9,$G27+2,11)))+IF(ISBLANK($H27),0,IF($H27<0,-$H27,IF($H27>9,$H27+2,11)))+IF(ISBLANK($I27),0,IF($I27<0,-$I27,IF($I27>9,$I27+2,11)))","v":35},{"$f":"IF(ISBLANK($E27),0,IF($E27>0,$E27,IF($E27<-9,-$E27+2,11)))+IF(ISBLANK($F27),0,IF($F27>0,$F27,IF($F27<-9,-$F27+2,11)))+IF(ISBLANK($G27),0,IF($G27>0,$G27,IF($G27<-9,-$G27+2,11)))+IF(ISBLANK($H27),0,IF($H27>0,$H27,IF($H27<-9,-$H27+2,11)))+IF(ISBLANK($I27),0,IF($I27>0,$I27,IF($I27<-9,-$I27+2,11)))","v":24},{"$f":"+AA27","v":24},{"$f":"+Z27","v":35}]
["1 contre 3",{"$f":"B20","v":"Flo"},{"$f":"B22","v":"Benjamin"},6,5,5,5,null,null,{"$f":"IF(SUM($E28:$I28)=0,0,IF(COUNTIF($E28:$I28,\">0\")-COUNTIF($E28:$I28,\"<0\")>0,1,0))","v":1},null,{"$f":"IF(SUM($E28:$I28)=0,0,IF(COUNTIF($E28:$I28,\">0\")-COUNTIF($E28:$I28,\"<0\")<0,1,0))","v":0},null,null,{"$f":"COUNTIF($E28:$I28,\">0\")","v":3},{"$f":"COUNTIF($E28:$I28,\"<0\")","v":0},null,null,{"$f":"+P28","v":0},{"$f":"+O28","v":3},null,null,null,{"$f":"IF(ISBLANK($E28),0,IF($E28<0,-$E28,IF($E28>9,$E28+2,11)))+IF(ISBLANK($F28),0,IF($F28<0,-$F28,IF($F28>9,$F28+2,11)))+IF(ISBLANK($G28),0,IF($G28<0,-$G28,IF($G28>9,$G28+2,11)))+IF(ISBLANK($H28),0,IF($H28<0,-$H28,IF($H28>9,$H28+2,11)))+IF(ISBLANK($I28),0,IF($I28<0,-$I28,IF($I28>9,$I28+2,11)))","v":33},{"$f":"IF(ISBLANK($E28),0,IF($E28>0,$E28,IF($E28<-9,-$E28+2,11)))+IF(ISBLANK($F28),0,IF($F28>0,$F28,IF($F28<-9,-$F28+2,11)))+IF(ISBLANK($G28),0,IF($G28>0,$G28,IF($G28<-9,-$G28+2,11)))+IF(ISBLANK($H28),0,IF($H28>0,$H28,IF($H28<-9,-$H28+2,11)))+IF(ISBLANK($I28),0,IF($I28>0,$I28,IF($I28<-9,-$I28+2,11)))","v":15},null,null,{"$f":"+Y28","v":15},{"$f":"+X28","v":33}]
["2 contre 4",{"$f":"B21","v":"Maxime"},{"$f":"B23","v":"Jules"},6,2,4,2,null,null,null,{"$f":"IF(SUM($E29:$I29)=0,0,IF(COUNTIF($E29:$I29,\">0\")-COUNTIF($E29:$I29,\"<0\")>0,1,0))","v":1},null,{"$f":"IF(SUM($E29:$I29)=0,0,IF(COUNTIF($E29:$I29,\">0\")-COUNTIF($E29:$I29,\"<0\")<0,1,0))","v":0},null,null,null,{"$f":"COUNTIF($E29:$I29,\">0\")","v":3},{"$f":"COUNTIF($E29:$I29,\"<0\")","v":0},null,null,{"$f":"+R29","v":0},{"$f":"+Q29","v":3},null,null,null,{"$f":"IF(ISBLANK($E29),0,IF($E29<0,-$E29,IF($E29>9,$E29+2,11)))+IF(ISBLANK($F29),0,IF($F29<0,-$F29,IF($F29>9,$F29+2,11)))+IF(ISBLANK($G29),0,IF($G29<0,-$G29,IF($G29>9,$G29+2,11)))+IF(ISBLANK($H29),0,IF($H29<0,-$H29,IF($H29>9,$H29+2,11)))+IF(ISBLANK($I29),0,IF($I29<0,-$I29,IF($I29>9,$I29+2,11)))","v":33},{"$f":"IF(ISBLANK($E29),0,IF($E29>0,$E29,IF($E29<-9,-$E29+2,11)))+IF(ISBLANK($F29),0,IF($F29>0,$F29,IF($F29<-9,-$F29+2,11)))+IF(ISBLANK($G29),0,IF($G29>0,$G29,IF($G29<-9,-$G29+2,11)))+IF(ISBLANK($H29),0,IF($H29>0,$H29,IF($H29<-9,-$H29+2,11)))+IF(ISBLANK($I29),0,IF($I29>0,$I29,IF($I29<-9,-$I29+2,11)))","v":8},null,null,{"$f":"+AA29","v":8},{"$f":"+Z29","v":33}]
["1 contre 2",{"$f":"B20","v":"Flo"},{"$f":"B21","v":"Maxime"},null,5,-6,-8,8,13,{"$f":"IF(SUM($E30:$I30)=0,0,IF(COUNTIF($E30:$I30,\">0\")-COUNTIF($E30:$I30,\"<0\")>0,1,0))","v":1},{"$f":"IF(SUM($E30:$I30)=0,0,IF(COUNTIF($E30:$I30,\">0\")-COUNTIF($E30:$I30,\"<0\")<0,1,0))","v":0},null,null,null,{"$f":"COUNTIF($E30:$I30,\">0\")","v":3},{"$f":"COUNTIF($E30:$I30,\"<0\")","v":2},{"$f":"+P30","v":2},{"$f":"+O30","v":3},null,null,null,null,null,{"$f":"IF(ISBLANK($E30),0,IF($E30<0,-$E30,IF($E30>9,$E30+2,11)))+IF(ISBLANK($F30),0,IF($F30<0,-$F30,IF($F30>9,$F30+2,11)))+IF(ISBLANK($G30),0,IF($G30<0,-$G30,IF($G30>9,$G30+2,11)))+IF(ISBLANK($H30),0,IF($H30<0,-$H30,IF($H30>9,$H30+2,11)))+IF(ISBLANK($I30),0,IF($I30<0,-$I30,IF($I30>9,$I30+2,11)))","v":51},{"$f":"IF(ISBLANK($E30),0,IF($E30>0,$E30,IF($E30<-9,-$E30+2,11)))+IF(ISBLANK($F30),0,IF($F30>0,$F30,IF($F30<-9,-$F30+2,11)))+IF(ISBLANK($G30),0,IF($G30>0,$G30,IF($G30<-9,-$G30+2,11)))+IF(ISBLANK($H30),0,IF($H30>0,$H30,IF($H30<-9,-$H30+2,11)))+IF(ISBLANK($I30),0,IF($I30>0,$I30,IF($I30<-9,-$I30+2,11)))","v":48},{"$f":"+Y30","v":48},{"$f":"+X30","v":51}]
["3 contre 4",{"$f":"B22","v":"Benjamin"},{"$f":"B23","v":"Jules"},6,null,null,null,null,null,null,null,{"$f":"IF(SUM($E31:$I31)=0,0,IF(COUNTIF($E31:$I31,\">0\")-COUNTIF($E31:$I31,\"<0\")>0,1,0))","v":0},{"$f":"IF(SUM($E31:$I31)=0,0,IF(COUNTIF($E31:$I31,\">0\")-COUNTIF($E31:$I31,\"<0\")<0,1,0))","v":0},null,null,null,null,null,{"$f":"COUNTIF($E31:$I31,\">0\")","v":0},{"$f":"COUNTIF($E31:$I31,\"<0\")","v":0},{"$f":"+T31","v":0},{"$f":"+S31","v":0},null,null,null,null,null,{"$f":"IF(ISBLANK($E31),0,IF($E31<0,-$E31,IF($E31>9,$E31+2,11)))+IF(ISBLANK($F31),0,IF($F31<0,-$F31,IF($F31>9,$F31+2,11)))+IF(ISBLANK($G31),0,IF($G31<0,-$G31,IF($G31>9,$G31+2,11)))+IF(ISBLANK($H31),0,IF($H31<0,-$H31,IF($H31>9,$H31+2,11)))+IF(ISBLANK($I31),0,IF($I31<0,-$I31,IF($I31>9,$I31+2,11)))","v":0},{"$f":"IF(ISBLANK($E31),0,IF($E31>0,$E31,IF($E31<-9,-$E31+2,11)))+IF(ISBLANK($F31),0,IF($F31>0,$F31,IF($F31<-9,-$F31+2,11)))+IF(ISBLANK($G31),0,IF($G31>0,$G31,IF($G31<-9,-$G31+2,11)))+IF(ISBLANK($H31),0,IF($H31>0,$H31,IF($H31<-9,-$H31+2,11)))+IF(ISBLANK($I31),0,IF($I31>0,$I31,IF($I31<-9,-$I31+2,11)))","v":0},{"$f":"+AC31","v":0},{"$f":"+AB31","v":0}]
[null,null,null,null,null,null,null,null,"Total",{"$f":"SUM(J26:J31)","v":3},{"$f":"SUM(K26:K31)","v":2},{"$f":"SUM(L26:L31)","v":0},{"$f":"SUM(M26:M31)","v":0},null,{"$f":"SUM(O26:O31)","v":9},2,8,3,0,6,0,6,null,{"$f":"SUM(X26:X31)","v":117},81,116,83,39,68,26,66]
[null,null,null,null,null,null,null,null,"Classement",1,2,4,3,null,{"$f":"IFERROR(O32/(O32+P32),0)","v":0.81818181818181823},null,{"$f":"IFERROR(Q32/(Q32+R32),0)","v":0.72727272727272729},null,{"$f":"IFERROR(S32/(S32+T32),0)","v":0},null,{"$f":"IFERROR(U32/(U32+V32),0)","v":0},null,null,{"$f":"IFERROR(X32/(X32+Y32),0)","v":0.59090909090909094},null,{"$f":"IFERROR(Z32/(Z32+AA32),0)","v":0.58291457286432158},null,{"$f":"IFERROR(AB32/(AB32+AC32),0)","v":0.3644859813084112},null,{"$f":"IFERROR(AD32/(AD32+AE32),0)","v":0.28260869565217389}]

{"sheet":"Feuil1","index":4,"n_rows":6,"n_cols":11,"rows_kept":6,"cut":false,"hidden":false,"merged":[]}
["3E",{"$f":"VLOOKUP(INDEX('Poules E - F'!$J$8:$M$8,MATCH(3,'Poules E - F'!$J$16:$M$16,0)),'Poules E - F'!$A$3:$C$6,2,FALSE)","v":"Axel"},{"$f":"INDEX('Poules E - F'!$J$15:$M$15,MATCH(3,'Poules E - F'!$J$16:$M$16,0))","v":0},{"$f":"HLOOKUP(INDEX('Poules E - F'!$J$8:$M$8,MATCH(3,'Poules E - F'!$J$16:$M$16,0)),'Poules E - F'!$O$7:$V$16,10,FALSE)","v":0},{"$f":"HLOOKUP(INDEX('Poules E - F'!$J$8:$M$8,MATCH(3,'Poules E - F'!$J$16:$M$16,0)),'Poules E - F'!$X$7:$AE$16,10,FALSE)","v":0.3125},null,"3B",{"$f":"VLOOKUP(INDEX('Poules A - B'!$J$25:$M$25,MATCH(3,'Poules A - B'!$J$33:$M$33,0)),'Poules A - B'!$A$20:$C$23,2,FALSE)","v":"Stephane"},{"$f":"INDEX('Poules A - B'!$J$32:$M$32,MATCH(3,'Poules A - B'!$J$33:$M$33,0))","v":0},{"$f":"HLOOKUP(INDEX('Poules A - B'!$J$25:$M$25,MATCH(3,'Poules A - B'!$J$33:$M$33,0)),'Poules A - B'!$O$24:$V$33,10,FALSE)","v":0.33333333333333331},{"$f":"HLOOKUP(INDEX('Poules A - B'!$J$25:$M$25,MATCH(3,'Poules A - B'!$J$33:$M$33,0)),'Poules A - B'!$X$24:$AE$33,10,FALSE)","v":0.44}]
["3F",{"$f":"VLOOKUP(INDEX('Poules E - F'!$J$25:$M$25,MATCH(3,'Poules E - F'!$J$33:$M$33,0)),'Poules E - F'!$A$20:$C$23,2,FALSE)","v":"Jules"},{"$f":"INDEX('Poules E - F'!$J$32:$M$32,MATCH(3,'Poules E - F'!$J$33:$M$33,0))","v":0},{"$f":"HLOOKUP(INDEX('Poules E - F'!$J$25:$M$25,MATCH(3,'Poules E - F'!$J$33:$M$33,0)),'Poules E - F'!$O$24:$V$33,10,FALSE)","v":0},{"$f":"HLOOKUP(INDEX('Poules E - F'!$J$25:$M$25,MATCH(3,'Poules E - F'!$J$33:$M$33,0)),'Poules E - F'!$X$24:$AE$33,10,FALSE)","v":0.28260869565217389},null,"3D",{"$f":"VLOOKUP(INDEX('Poules C - D'!$J$25:$M$25,MATCH(3,'Poules C - D'!$J$33:$M$33,0)),'Poules C - D'!$A$20:$C$23,2,FALSE)","v":"Eric"},{"$f":"INDEX('Poules C - D'!$J$32:$M$32,MATCH(3,'Poules C - D'!$J$33:$M$33,0))","v":0},{"$f":"HLOOKUP(INDEX('Poules C - D'!$J$25:$M$25,MATCH(3,'Poules C - D'!$J$33:$M$33,0)),'Poules C - D'!$O$24:$V$33,10,FALSE)","v":0.25},{"$f":"HLOOKUP(INDEX('Poules C - D'!$J$25:$M$25,MATCH(3,'Poules C - D'!$J$33:$M$33,0)),'Poules C - D'!$X$24:$AE$33,10,FALSE)","v":0.4370860927152318}]
["3B",{"$f":"VLOOKUP(INDEX('Poules A - B'!$J$25:$M$25,MATCH(3,'Poules A - B'!$J$33:$M$33,0)),'Poules A - B'!$A$20:$C$23,2,FALSE)","v":"Stephane"},{"$f":"INDEX('Poules A - B'!$J$32:$M$32,MATCH(3,'Poules A - B'!$J$33:$M$33,0))","v":0},{"$f":"HLOOKUP(INDEX('Poules A - B'!$J$25:$M$25,MATCH(3,'Poules A - B'!$J$33:$M$33,0)),'Poules A - B'!$O$24:$V$33,10,FALSE)","v":0.33333333333333331},{"$f":"HLOOKUP(INDEX('Poules A - B'!$J$25:$M$25,MATCH(3,'Poules A - B'!$J$33:$M$33,0)),'Poules A - B'!$X$24:$AE$33,10,FALSE)","v":0.44},null,"3A",{"$f":"VLOOKUP(INDEX('Poules A - B'!$J$8:$M$8,MATCH(3,'Poules A - B'!$J$16:$M$16,0)),'Poules A - B'!$A$3:$C$6,2,FALSE)","v":"SebAZ"},{"$f":"INDEX('Poules A - B'!$J$15:$M$15,MATCH(3,'Poules A - B'!$J$16:$M$16,0))","v":0},{"$f":"HLOOKUP(INDEX('Poules A - B'!$J$8:$M$8,MATCH(3,'Poules A - B'!$J$16:$M$16,0)),'Poules A - B'!$O$7:$V$16,10,FALSE)","v":0.14285714285714285},{"$f":"HLOOKUP(INDEX('Poules A - B'!$J$8:$M$8,MATCH(3,'Poules A - B'!$J$16:$M$16,0)),'Poules A - B'!$X$7:$AE$16,10,FALSE)","v":0.40740740740740738}]
["3D",{"$f":"VLOOKUP(INDEX('Poules C - D'!$J$25:$M$25,MATCH(3,'Poules C - D'!$J$33:$M$33,0)),'Poules C - D'!$A$20:$C$23,2,FALSE)","v":"Eric"},{"$f":"INDEX('Poules C - D'!$J$32:$M$32,MATCH(3,'Poules C - D'!$J$33:$M$33,0))","v":0},{"$f":"HLOOKUP(INDEX('Poules C - D'!$J$25:$M$25,MATCH(3,'Poules C - D'!$J$33:$M$33,0)),'Poules C - D'!$O$24:$V$33,10,FALSE)","v":0.25},{"$f":"HLOOKUP(INDEX('Poules C - D'!$J$25:$M$25,MATCH(3,'Poules C - D'!$J$33:$M$33,0)),'Poules C - D'!$X$24:$AE$33,10,FALSE)","v":0.4370860927152318},null,"3C",{"$f":"VLOOKUP(INDEX('Poules C - D'!$J$8:$M$8,MATCH(3,'Poules C - D'!$J$16:$M$16,0)),'Poules C - D'!$A$3:$C$6,2,FALSE)","v":"Romain"},{"$f":"INDEX('Poules C - D'!$J$15:$M$15,MATCH(3,'Poules C - D'!$J$16:$M$16,0))","v":0},{"$f":"HLOOKUP(INDEX('Poules C - D'!$J$8:$M$8,MATCH(3,'Poules C - D'!$J$16:$M$16,0)),'Poules C - D'!$O$7:$V$16,10,FALSE)","v":0},{"$f":"HLOOKUP(INDEX('Poules C - D'!$J$8:$M$8,MATCH(3,'Poules C - D'!$J$16:$M$16,0)),'Poules C - D'!$X$7:$AE$16,10,FALSE)","v":0.36607142857142855}]
["3A",{"$f":"VLOOKUP(INDEX('Poules A - B'!$J$8:$M$8,MATCH(3,'Poules A - B'!$J$16:$M$16,0)),'Poules A - B'!$A$3:$C$6,2,FALSE)","v":"SebAZ"},{"$f":"INDEX('Poules A - B'!$J$15:$M$15,MATCH(3,'Poules A - B'!$J$16:$M$16,0))","v":0},{"$f":"HLOOKUP(INDEX('Poules A - B'!$J$8:$M$8,MATCH(3,'Poules A - B'!$J$16:$M$16,0)),'Poules A - B'!$O$7:$V$16,10,FALSE)","v":0.14285714285714285},{"$f":"HLOOKUP(INDEX('Poules A - B'!$J$8:$M$8,MATCH(3,'Poules A - B'!$J$16:$M$16,0)),'Poules A - B'!$X$7:$AE$16,10,FALSE)","v":0.40740740740740738},null,"3E",{"$f":"VLOOKUP(INDEX('Poules E - F'!$J$8:$M$8,MATCH(3,'Poules E - F'!$J$16:$M$16,0)),'Poules E - F'!$A$3:$C$6,2,FALSE)","v":"Axel"},{"$f":"INDEX('Poules E - F'!$J$15:$M$15,MATCH(3,'Poules E - F'!$J$16:$M$16,0))","v":0},{"$f":"HLOOKUP(INDEX('Poules E - F'!$J$8:$M$8,MATCH(3,'Poules E - F'!$J$16:$M$16,0)),'Poules E - F'!$O$7:$V$16,10,FALSE)","v":0},{"$f":"HLOOKUP(INDEX('Poules E - F'!$J$8:$M$8,MATCH(3,'Poules E - F'!$J$16:$M$16,0)),'Poules E - F'!$X$7:$AE$16,10,FALSE)","v":0.3125}]
["3C",{"$f":"VLOOKUP(INDEX('Poules C - D'!$J$8:$M$8,MATCH(3,'Poules C - D'!$J$16:$M$16,0)),'Poules C - D'!$A$3:$C$6,2,FALSE)","v":"Romain"},{"$f":"INDEX('Poules C - D'!$J$15:$M$15,MATCH(3,'Poules C - D'!$J$16:$M$16,0))","v":0},{"$f":"HLOOKUP(INDEX('Poules C - D'!$J$8:$M$8,MATCH(3,'Poules C - D'!$J$16:$M$16,0)),'Poules C - D'!$O$7:$V$16,10,FALSE)","v":0},{"$f":"HLOOKUP(INDEX('Poules C - D'!$J$8:$M$8,MATCH(3,'Poules C - D'!$J$16:$M$16,0)),'Poules C - D'!$X$7:$AE$16,10,FALSE)","v":0.36607142857142855},null,"3F",{"$f":"VLOOKUP(INDEX('Poules E - F'!$J$25:$M$25,MATCH(3,'Poules E - F'!$J$33:$M$33,0)),'Poules E - F'!$A$20:$C$23,2,FALSE)","v":"Jules"},{"$f":"INDEX('Poules E - F'!$J$32:$M$32,MATCH(3,'Poules E - F'!$J$33:$M$33,0))","v":0},{"$f":"HLOOKUP(INDEX('Poules E - F'!$J$25:$M$25,MATCH(3,'Poules E - F'!$J$33:$M$33,0)),'Poules E - F'!$O$24:$V$33,10,FALSE)","v":0},{"$f":"HLOOKUP(INDEX('Poules E - F'!$J$25:$M$25,MATCH(3,'Poules E - F'!$J$33:$M$33,0)),'Poules E - F'!$X$24:$AE$33,10,FALSE)","v":0.28260869565217389}]